{"text_format":"1","workbook":"xlsx","n_sheets":7,"sheets":["Revision Data","User Instructions","DataEntry","YoudenGraph","LineGraphs","LineGraphData","YoudenCalculations"],"not_rendered":{"charts":5,"images":0,"macros":1,"external_links":0,"defined_names":10,"comments":1,"pivot_tables":0},"unopened":[],"bounds":{"document_bytes":16777216,"sheet_cells":100000,"rows_first":2000,"rows_last":500,"rows_between":2000,"halvings":0,"cell_chars":16384,"cell_head_chars":4096},"cells_cut":0,"cells_raw":0,"read":"whole","date_system":"1900"}

{"sheet":"Revision Data","index":0,"n_rows":5,"n_cols":3,"rows_kept":5,"cut":false,"hidden":false,"merged":[[0,0,0,2]]}
["Document Control"]
["Revision Date","By","Comments"]
["Pre-2012","K. Fraley","Original Creation of Youden Template by Ken Fraley."]
[20230213,"G. Harris","Introduction of User Instructions with Disclaimer and Document Control information - NO changes to calculations or functional operation of the Youden analysis tools or buttons. File was saved to xlsm since the buttons are macro driven.  (Change for posting online if needed?)"]
["2023-02-13","G. Harris","Standardizing naming and formats of the PT-Plan and PT-Analysis templates. Making sure the Revisions and User Instruction tabs are consistent."]

{"sheet":"User Instructions","index":1,"n_rows":20,"n_cols":2,"rows_kept":20,"cut":false,"hidden":false,"merged":[]}
[]
["Filename:",{"$f":"CELL(\"filename\")","v":"C:\\Users\\glh\\Desktop\\[pt-analysis-youden-template-20230302.xlsm]LineGraphData"}]
["Feedback:","If you find errors, have feedback, questions or have suggestions on improvements, send an email to NIST Office of Weights and Measures, Laboratory Metrology Group: micheal.hicks@nist.gov, elizabeth.koncki@nist.gov, isabel.chavez.baucom@nist.gov."]
["Disclaimer for Users Outside the OWM PT Program ","NOTICE:\nThis workbook is provided by NIST Office of Weights and Measures (NIST OWM) as a tool to assist in the analysis of proficiency testing data developed under the NIST OWM Proficiency Testing Program as covered by \"NISTIR 7214\" \"Office of Weights and Measures, Quality Manual For Proficiency Testing and Interlaboratory Comparisons\".  The equations, calculations, and formatting of this workbook have been verified and validated.  However users for other applications are advised that they are responsible for ensuring this resource is correct and functions as used and the user of this workbook is responsible for validation and verification on their computer system.  This workbook was developed solely to simplify the data analysis and presentation of proficiency test data in the NIST OWM Proficiency Testing Program. Use of this tool for other purposes is done at the sole risk of the user. Under no circumstances shall NIST OWM, or any of their partners that helped create the tools, be liable for any damages, including incidental, special or consequential damages, arising from the use of these workbooks or an inability to use them."]
["Verify Version at OWM Link","WARNING:\nIf you distribute these tools through any means other than the NIST Office of Weights and Measures Laboratory Metrology group website at www.nist.gov/labmetrology, you should check that website to ensure the tool being provided is the latest version available, and provide information to users on how to check for updates and revisions to the tools."]
[]
["Item","Instructions and Tips for Using this Workbook \nEnsure familiarity and use of Standard Operating Procedure for OWM PT Planning, Operating, Analyzing, and Reporting PT Results"]
[1,"Before using the Template, save this workbook as the name of the PT identified in the PT Plan, keeping analysis-youden in the file name with the latest revision date entered at the end of the filename as yyyymmdd.  As the file is updated, \"Save As\" with a new date in the file name. "]
[2,"All cells in this workbook shaded in a color can have data entered.  Non-shaded cells are locked to prevent accidental alteration. Review the DataEntry and YoudenGraph worksheets before continuing with these instructions to have a sense of what the 10 kg sample data looks like on the DataEntry and Youden Graph sheets."]
[3,"On the DataEntry Sheet, replace the \"template\" information with the current PT information: RMAP Region, PT Item #1, PT Item #2, Applicable Tolerance, Data Analyzed using Median, Mean, or NIST (Enter exactly per instructions on the sheet, as this is used later), and enter Units. "]
{"$rows_left_out":11}
{"sheet":"DataEntry","index":2,"n_rows":39,"n_cols":18,"rows_kept":39,"cut":false,"hidden":false,"merged":[]}
["Data Entry Form for Youden Analysis",null,null,null,"Printing Note",null,null,null,null,"Are NIST Values Available?","no",null,null,null,null,null,{"$f":"Title&\" (\"&TEXT(R2,\"mmm d, yy\")&\" thru \"&TEXT(Q2,\"mmm d, yy\")&\")\"","v":"RMAP (Jan 1, 00 thru Oct 1, 00)"}]
[null,null,null,null,null,null,null,null,null,null,null,null,null,null,null,null,{"$f":"MAX(C10:C39,F10:F39)","v":"2000-10-01"},{"$f":"MIN(C10:C39,F10:F39)","v":"2000-01-01"}]
["RMAP Group:","RMAP",null,null,null,null,null,null,null,{"$f":"IF(K1=\"yes\",\"NIST \"&B4&\" Value =\",\"\")","v":""},0]
["PT Item #1:","10 kg #1",null,null,null,null,null,null,null,{"$f":"IF(K1=\"yes\",\"NIST \"&B4&\" Unc =\",\"\")","v":""},2.1]
["PT Item #2:","10 kg #2"]
["Tolerance:",23,null,null,null,null,null,null,null,{"$f":"IF(K1=\"yes\",\"NIST \"&B5&\" Value =\",\"\")","v":""},0]
["Data Analyzed Using:","Median",null,null,null,null,null,null,null,{"$f":"IF(K1=\"yes\",\"NIST \"&B5&\" Unc =\",\"\")","v":""},2.1]
["Units:","milligrams"]
[null,"Metrologist",{"$f":"\"Date \"&B4","v":"Date 10 kg #1"},{"$f":"B4","v":"10 kg #1"},{"$f":"\"Unc \"&B4","v":"Unc 10 kg #1"},{"$f":"\"Date \"&B5","v":"Date 10 kg #2"},{"$f":"B5","v":"10 kg #2"},{"$f":"\"Unc \"&B5","v":"Unc 10 kg #2"},null,"Ave Unc"]
[1,"A","2000-01-01",-2,5,"2000-09-28",-7,5,null,{"$f":"IF(AND(E10>0,H10>0),AVERAGE(E10,H10),\"\")","v":5}]
{"$rows_left_out":30}
{"sheet":"YoudenGraph","index":3,"n_rows":22,"n_cols":18,"rows_kept":22,"cut":false,"hidden":false,"merged":[[1,1,1,2],[2,1,2,2],[3,1,3,2],[4,1,4,2],[2,11,2,12],[3,11,3,12],[4,11,4,12],[1,3,1,5],[2,3,2,5],[3,3,3,5],[4,3,4,5]]}
[null,null,null,null,null,null,null,{"$f":"DataEntry!Q1","v":"RMAP (Jan 1, 00 thru Oct 1, 00)"}]
[null,{"$f":"YoudenCalculations!J10","v":"10 kg #1"},null,{"$f":"YoudenCalculations!K10","v":"10 kg #2"},null,null,null,null,null,null,{"$f":"\"(All values are in \"&DataEntry!B8&\")\"","v":"(All values are in milligrams)"}]
["Median",{"$f":"YoudenCalculations!J5","v":1.5},null,{"$f":"YoudenCalculations!K5","v":-3},null,null,null,null,null,null,"Youden sd =",{"$f":"YoudenCalculations!Q1","v":2.9199571150226551}]
["Mean",{"$f":"YoudenCalculations!J6","v":1.375},null,{"$f":"YoudenCalculations!K6","v":-1.875},null,null,null,null,null,null,"Circle Radius =",{"$f":"YoudenCalculations!Q2","v":7.1538949318055058}]
[{"$f":"YoudenCalculations!I7","v":""},{"$f":"YoudenCalculations!J7","v":""},null,{"$f":"YoudenCalculations!K7","v":""},null,null,null,null,null,null,"Circle Center =",{"$f":"DataEntry!B7","v":"Median"}]
[]
[{"$f":"YoudenCalculations!I10","v":"Metrologist"},{"$f":"YoudenCalculations!J10","v":"10 kg #1"},{"$f":"YoudenCalculations!K10","v":"10 kg #2"},{"$f":"YoudenCalculations!S10","v":"Unc"},{"$f":"YoudenCalculations!N10","v":"SYS"},{"$f":"YoudenCalculations!O10","v":"RAN"},{"$f":"YoudenCalculations!T10","v":"Unc Test"},null,{"$f":"IF(LineGraphData!S5>15,A7,\"\")","v":""},{"$f":"IF(LineGraphData!S5>15,B7,\"\")","v":""},{"$f":"IF(LineGraphData!S5>15,C7,\"\")","v":""},{"$f":"IF(LineGraphData!S5>15,D7,\"\")","v":""},{"$f":"IF(LineGraphData!S5>15,E7,\"\")","v":""},{"$f":"IF(LineGraphData!S5>15,F7,\"\")","v":""},{"$f":"IF(LineGraphData!S5>15,G7,\"\")","v":""}]
[{"$f":"YoudenCalculations!I11","v":"A"},{"$f":"YoudenCalculations!J11","v":-2},{"$f":"YoudenCalculations!K11","v":-7},{"$f":"YoudenCalculations!S11","v":5},{"$f":"YoudenCalculations!N11","v":-4.9828808497193675},{"$f":"YoudenCalculations!O11","v":0.33219205664795787},{"$f":"YoudenCalculations!T11","v":"Warning"},null,{"$f":"YoudenCalculations!I26","v":""},{"$f":"YoudenCalculations!J26","v":""},{"$f":"YoudenCalculations!K26","v":""},{"$f":"YoudenCalculations!S26","v":""},{"$f":"YoudenCalculations!N26","v":""},{"$f":"YoudenCalculations!O26","v":""},{"$f":"YoudenCalculations!T26","v":""},null,"OUT R&S","Both the random and systematic error exceed the uncertainty"]
[{"$f":"YoudenCalculations!I12","v":"B"},{"$f":"YoudenCalculations!J12","v":1},{"$f":"YoudenCalculations!K12","v":-3},{"$f":"YoudenCalculations!S12","v":8},{"$f":"YoudenCalculations!N12","v":-0.25},{"$f":"YoudenCalculations!O12","v":0.25000000000000006},{"$f":"YoudenCalculations!T12","v":"IN"},null,{"$f":"YoudenCalculations!I27","v":""},{"$f":"YoudenCalculations!J27","v":""},{"$f":"YoudenCalculations!K27","v":""},{"$f":"YoudenCalculations!S27","v":""},{"$f":"YoudenCalculations!N27","v":""},{"$f":"YoudenCalculations!O27","v":""},{"$f":"YoudenCalculations!T27","v":""},null,"OUT Sys","Only the systematic error exceeds the uncertainty"]
[{"$f":"YoudenCalculations!I13","v":"C"},{"$f":"YoudenCalculations!J13","v":4},{"$f":"YoudenCalculations!K13","v":-8},{"$f":"YoudenCalculations!S13","v":6},{"$f":"YoudenCalculations!N13","v":-1.3975424859373684},{"$f":"YoudenCalculations!O13","v":4.1926274578121063},{"$f":"YoudenCalculations!T13","v":"IN"},null,{"$f":"YoudenCalculations!I28","v":""},{"$f":"YoudenCalculations!J28","v":""},{"$f":"YoudenCalculations!K28","v":""},{"$f":"YoudenCalculations!S28","v":""},{"$f":"YoudenCalculations!N28","v":""},{"$f":"YoudenCalculations!O28","v":""},{"$f":"YoudenCalculations!T28","v":""},null,"OUT Ran","Only the random portion of the error exceeds the uncertainty"]
{"$rows_left_out":13}
{"sheet":"LineGraphs","index":4,"n_rows":0,"n_cols":0,"rows_kept":0,"cut":false,"hidden":false,"merged":[]}

{"sheet":"LineGraphData","index":5,"n_rows":46,"n_cols":48,"rows_kept":46,"cut":false,"hidden":false,"merged":[[4,1,4,2],[4,3,4,4],[3,1,3,2],[1,1,1,2],[2,1,2,2],[1,3,1,4],[2,3,2,4],[3,3,3,4]]}
[null,null,null,null,null,{"$f":"DataEntry!Q1","v":"RMAP (Jan 1, 00 thru Oct 1, 00)"},null,null,null,null,null,null,null,null,null,null,null,null,{"$f":"DataEntry!B7","v":"Median"},{"$f":"DataEntry!B7","v":"Median"},null,null,{"$f":"DataEntry!Q1&\" \"&C16&\" (analyzed versus \"&S1&\")\"","v":"RMAP (Jan 1, 00 thru Oct 1, 00) 10 kg #1 (analyzed versus Median)"},null,null,null,null,null,null,null,null,{"$f":"DataEntry!Q1&\" \"&I16&\" (analyzed versus \"&T1&\")\"","v":"RMAP (Jan 1, 00 thru Oct 1, 00) 10 kg #2 (analyzed versus Median)"},null,null,null,null,null,null,null,{"$f":"DataEntry!Q1&\" Enormal Test (must be <1)\"","v":"RMAP (Jan 1, 00 thru Oct 1, 00) Enormal Test (must be <1)"}]
[null,{"$f":"DataEntry!B4","v":"10 kg #1"},null,{"$f":"DataEntry!B5","v":"10 kg #2"},null,null,null,null,null,null,{"$f":"\"(All values are in \"&DataEntry!B8&\")\"","v":"(All values are in milligrams)"},null,null,null,null,null,null,"Old 2sd =",{"$f":"STDEV(C17:C46)*2","v":3.6936238496708271},{"$f":"STDEV(I17:I46)*2","v":10.819955109492302},null,null,null,{"$f":"C16&\" Enormal\"","v":"10 kg #1 Enormal"}]
["Median",{"$f":"YoudenCalculations!J5","v":1.5},null,{"$f":"YoudenCalculations!K5","v":-3},null,null,null,null,{"$f":"DataEntry!B7&\" Value \"&B2&\" =\"","v":"Median Value 10 kg #1 ="},{"$f":"YoudenCalculations!J1","v":1.5},{"$f":"\"n=\"&S5","v":"n=8"},null,null,null,null,null,null,"New 2sd=",{"$f":"STDEV(S17:S46)*2","v":3.6936238496708271},{"$f":"STDEV(T17:T46)*2","v":6.817344825970773},null,null,null,null,null,null,null,null,null,null,null,null,null,null,null,null,null,null,null,null,null,null,null,null,{"$f":"DataEntry!Q1&\" Precision Ratio (must be >3)\"","v":"RMAP (Jan 1, 00 thru Oct 1, 00) Precision Ratio (must be >3)"}]
["Mean",{"$f":"YoudenCalculations!J6","v":1.375},null,{"$f":"YoudenCalculations!K6","v":-1.875},null,null,null,null,{"$f":"DataEntry!B7&\" Unc \"&B2&\" =\"","v":"Median Unc 10 kg #1 ="},{"$f":"YoudenCalculations!J2","v":3.6936238496708271},{"$f":"\"n=\"&S5","v":"n=8"},null,null,null,null,null,null,"New Value =",{"$f":"IF(S1=\"NIST\",B5,IF(S1=\"Median\",MEDIAN(S17:S46),IF(S1=\"Mean\",AVERAGE(S17:S46),\"INPUT ERROR\")))","v":1.5},{"$f":"IF(T1=\"NIST\",D5,IF(T1=\"Median\",MEDIAN(T17:T46),IF(T1=\"Mean\",AVERAGE(T17:T46),\"INPUT ERROR\")))","v":-3}]
[{"$f":"YoudenCalculations!I7","v":""},{"$f":"YoudenCalculations!J7","v":""},null,{"$f":"YoudenCalculations!K7","v":""},null,null,null,null,{"$f":"\"New \"&DataEntry!B7&\" Value \"&B2&\" =\"","v":"New Median Value 10 kg #1 ="},{"$f":"IF($S$1=\"NIST\",B5,S4)","v":1.5},{"$f":"\"n=\"&S6","v":"n=8"},null,null,null,null,null,null,null,{"$f":"COUNT(DataEntry!D10:D39)","v":8},{"$f":"COUNT(DataEntry!E10:E39)","v":8}]
[null,null,null,null,null,null,null,null,{"$f":"\"New \"&DataEntry!B7&\" Unc \"&B2&\" =\"","v":"New Median Unc 10 kg #1 ="},{"$f":"IF($S$1=\"NIST\",J4,S3)","v":3.6936238496708271},{"$f":"\"n=\"&S6","v":"n=8"},null,null,null,null,null,null,null,{"$f":"COUNT(S17:S46)","v":8},{"$f":"COUNT(T17:T46)","v":7}]
[]
[null,null,null,null,null,null,null,null,{"$f":"DataEntry!B7&\" Value \"&D2&\" =\"","v":"Median Value 10 kg #2 ="},{"$f":"YoudenCalculations!K1","v":-3},{"$f":"\"n=\"&T5","v":"n=8"}]
[null,null,null,null,null,null,null,null,{"$f":"DataEntry!B7&\" Unc \"&D2&\" =\"","v":"Median Unc 10 kg #2 ="},{"$f":"YoudenCalculations!K2","v":10.819955109492302},{"$f":"\"n=\"&T5","v":"n=8"}]
[null,null,null,null,null,null,null,null,{"$f":"\"New \"&DataEntry!B7&\" Value \"&D2&\" =\"","v":"New Median Value 10 kg #2 ="},{"$f":"IF($S$1=\"NIST\",D5,T4)","v":-3},{"$f":"\"n=\"&T6","v":"n=7"}]
{"$rows_left_out":37}
{"sheet":"YoudenCalculations","index":6,"n_rows":140,"n_cols":31,"rows_kept":140,"cut":false,"hidden":false,"merged":[]}
["DO NOT CHANGE OR EDIT THIS SHEET!",null,null,null,null,null,null,null,{"$f":"IF(DataEntry!B7=\"Median\",YoudenCalculations!I5,IF(DataEntry!B7=\"Mean\",YoudenCalculations!I6,IF(AND(DataEntry!B7=\"NIST\",DataEntry!K1=\"yes\"),I7,\"INPUT ERROR\")))","v":"Median="},{"$f":"IF(DataEntry!B7=\"Median\",YoudenCalculations!J5,IF(DataEntry!B7=\"Mean\",YoudenCalculations!J6,IF(AND(DataEntry!B7=\"NIST\",DataEntry!K1=\"yes\"),DataEntry!K3,\"INPUT ERROR\")))","v":1.5},{"$f":"IF(DataEntry!B7=\"Median\",YoudenCalculations!K5,IF(DataEntry!B7=\"Mean\",YoudenCalculations!K6,IF(AND(DataEntry!B7=\"NIST\",DataEntry!K1=\"yes\"),DataEntry!K6,\"INPUT ERROR\")))","v":-3},null,null,null,null,"s=",{"$f":"SQRT(SUM(Q11:Q40)/(COUNT(Q11:Q40)-1))","v":2.9199571150226551},null,null,null,null,null,null,{"$f":"J10","v":"10 kg #1"},{"$f":"J1","v":1.5},null,null,{"$f":"X1","v":"10 kg #1"},"Y",{"$f":"X2","v":"10 kg #2"},"Systematic"]
[null,null,null,null,null,null,null,null,"Unc",{"$f":"IF(DataEntry!B7=\"Median\",YoudenCalculations!J4,IF(DataEntry!B7=\"Mean\",YoudenCalculations!J4,IF(AND(DataEntry!B7=\"NIST\",DataEntry!K1=\"yes\"),DataEntry!K4,\"INPUT ERROR\")))","v":3.6936238496708271},{"$f":"IF(DataEntry!B7=\"Median\",YoudenCalculations!K4,IF(DataEntry!B7=\"Mean\",YoudenCalculations!K4,IF(AND(DataEntry!B7=\"NIST\",DataEntry!K1=\"yes\"),DataEntry!K7,\"INPUT ERROR\")))","v":10.819955109492302},null,null,null,null,"S*2.45=",{"$f":"Q1*2.45","v":7.1538949318055058},"\"95% confidence\"",null,null,null,null,null,{"$f":"K10","v":"10 kg #2"},{"$f":"K1","v":-3},null,null,{"$f":"$Y$1-Y3","v":-5.6538949318055058},{"$f":"SQRT(ABS(($Y$3^2)-((AB2-$Y$1)^2)))+$Y$2","v":-3}]
[null,null,null,null,null,null,null,null,null,null,null,null,null,null,null,null,null,null,null,null,null,null,null,"radius",{"$f":"Q2","v":7.1538949318055058},{"$f":"Y3/25","v":0.28615579727222024},null,{"$f":"AB2+$Z$3","v":-5.3677391345332852},{"$f":"SQRT(ABS(($Y$3^2)-((AB3-$Y$1)^2)))+$Y$2","v":-0.99690941909445741}]
[null,null,null,null,null,null,null,null,"2sd =",{"$f":"STDEV(J11:J40)*2","v":3.6936238496708271},{"$f":"STDEV(K11:K40)*2","v":10.819955109492302},null,null,null,null,null,null,"Uncertainty Analysis",null,null,null,null,null,null,null,null,null,{"$f":"AB3+$Z$3","v":-5.0815833372610646},-0.19625723897501413]
[null,null,null,null,null,null,null,null,"Median=",{"$f":"MEDIAN(J11:J40)","v":1.5},{"$f":"MEDIAN(K11:K40)","v":-3},null,null,null,null,null,null,"OUT R&S","Both the random and systematic error exceed the uncertainty",null,null,null,null,null,null,null,null,-4.795427539988844,0.39791182699941752]
[null,null,null,null,null,null,null,null,"Mean=",{"$f":"AVERAGE(J11:J40)","v":1.375},{"$f":"AVERAGE(K11:K40)","v":-1.875},null,null,null,null,null,null,"OUT Sys","Only the systematic error exceeds the uncertainty",null,null,null,null,null,null,null,null,-4.5092717427166233,0.88160608736899215]
[null,null,null,null,null,null,null,null,{"$f":"IF(DataEntry!K1=\"yes\",\"NIST\",\"\")","v":""},{"$f":"IF(DataEntry!K1=\"yes\",DataEntry!K3,\"\")","v":""},{"$f":"IF(DataEntry!K1=\"yes\",DataEntry!K6,\"\")","v":""},null,null,null,{"$f":"M11^2","v":0.12500000000000003},null,null,"OUT Ran","Only the random portion of the error exceeds the uncertainty",null,null,null,null,null,null,null,null,-4.2231159454444027,1.2923369590833067]
[null,null,null,null,null,null,null,null,null,null,null,null,null,null,null,null,null,"Warning","Only the summation of the random and systematic errors exceed the uncertainty",null,null,null,null,null,null,null,null,-3.9369601481721825,1.6494813734974807]
[null,null,null,null,null,null,null,null,null,null,null,null,null,null,null,null,null,"IN","The measurement process appears to be within control",null,null,null,null,null,null,null,null,-3.6508043508999624,1.9646175314985257]
[null,null,null,null,null,null,null,null,"Metrologist",{"$f":"DataEntry!B4","v":"10 kg #1"},{"$f":"DataEntry!B5","v":"10 kg #2"},"sys","ran","SYS","RAN",null,"RAN^2","ERROR","Unc","Unc Test",null,null,null,null,null,null,null,-3.3646485536277422,2.2453224062015504]
{"$rows_left_out":130}