{"text_format":"1","workbook":"xlsx","n_sheets":7,"sheets":["Revision Data","User Instructions","DataEntry","YoudenGraph","LineGraphs","LineGraphData","YoudenCalculations"],"not_rendered":{"charts":5,"images":0,"macros":1,"external_links":0,"defined_names":10,"comments":1,"pivot_tables":0},"unopened":[],"bounds":{"document_bytes":16777216,"sheet_cells":100000,"rows_first":2000,"rows_last":500,"rows_between":2000,"halvings":0,"cell_chars":16384,"cell_head_chars":4096},"cells_cut":0,"cells_raw":0,"read":"whole","date_system":"1900"}

{"sheet":"Revision Data","index":0,"n_rows":5,"n_cols":3,"rows_kept":5,"cut":false,"hidden":false,"merged":[[0,0,0,2]]}
["Document Control"]
["Revision Date","By","Comments"]
["Pre-2012","K. Fraley","Original Creation of Youden Template by Ken Fraley."]
[20230213,"G. Harris","Introduction of User Instructions with Disclaimer and Document Control information - NO changes to calculations or functional operation of the Youden analysis tools or buttons. File was saved to xlsm since the buttons are macro driven.  (Change for posting online if needed?)"]
["2023-02-13","G. Harris","Standardizing naming and formats of the PT-Plan and PT-Analysis templates. Making sure the Revisions and User Instruction tabs are consistent."]

{"sheet":"User Instructions","index":1,"n_rows":20,"n_cols":2,"rows_kept":20,"cut":false,"hidden":false,"merged":[]}
[]
["Filename:",{"$f":"CELL(\"filename\")","v":"C:\\Users\\glh\\Desktop\\[pt-analysis-youden-template-20230302.xlsm]LineGraphData"}]
["Feedback:","If you find errors, have feedback, questions or have suggestions on improvements, send an email to NIST Office of Weights and Measures, Laboratory Metrology Group: micheal.hicks@nist.gov, elizabeth.koncki@nist.gov, isabel.chavez.baucom@nist.gov."]
["Disclaimer for Users Outside the OWM PT Program ","NOTICE:\nThis workbook is provided by NIST Office of Weights and Measures (NIST OWM) as a tool to assist in the analysis of proficiency testing data developed under the NIST OWM Proficiency Testing Program as covered by \"NISTIR 7214\" \"Office of Weights and Measures, Quality Manual For Proficiency Testing and Interlaboratory Comparisons\".  The equations, calculations, and formatting of this workbook have been verified and validated.  However users for other applications are advised that they are responsible for ensuring this resource is correct and functions as used and the user of this workbook is responsible for validation and verification on their computer system.  This workbook was developed solely to simplify the data analysis and presentation of proficiency test data in the NIST OWM Proficiency Testing Program. Use of this tool for other purposes is done at the sole risk of the user. Under no circumstances shall NIST OWM, or any of their partners that helped create the tools, be liable for any damages, including incidental, special or consequential damages, arising from the use of these workbooks or an inability to use them."]
["Verify Version at OWM Link","WARNING:\nIf you distribute these tools through any means other than the NIST Office of Weights and Measures Laboratory Metrology group website at www.nist.gov/labmetrology, you should check that website to ensure the tool being provided is the latest version available, and provide information to users on how to check for updates and revisions to the tools."]
[]
["Item","Instructions and Tips for Using this Workbook \nEnsure familiarity and use of Standard Operating Procedure for OWM PT Planning, Operating, Analyzing, and Reporting PT Results"]
[1,"Before using the Template, save this workbook as the name of the PT identified in the PT Plan, keeping analysis-youden in the file name with the latest revision date entered at the end of the filename as yyyymmdd.  As the file is updated, \"Save As\" with a new date in the file name. "]
[2,"All cells in this workbook shaded in a color can have data entered.  Non-shaded cells are locked to prevent accidental alteration. Review the DataEntry and YoudenGraph worksheets before continuing with these instructions to have a sense of what the 10 kg sample data looks like on the DataEntry and Youden Graph sheets."]
[3,"On the DataEntry Sheet, replace the \"template\" information with the current PT information: RMAP Region, PT Item #1, PT Item #2, Applicable Tolerance, Data Analyzed using Median, Mean, or NIST (Enter exactly per instructions on the sheet, as this is used later), and enter Units. "]
[4,"On the DataEntry Sheet (cell K1) enter \"yes\" or \"no\" for NIST data if available; then enter values and uncertainties for the PT Items if pressing yes, for the data entry cells when they appear. "]
[5,"Press the Clear Data button to remove the template data used as an example. If macros were not enabled, you can delete the data in cells B10 through H17."]
[6,"On the DataEntry Sheet, enter the Metrologist using the instructions in the PT Analysis Template for consistency (LabCode+Metrologist-Initials, e.g., OWM-GH for NIST Office of Weights and Measures and Georgia Harris)."]
[7,"On the DataEntry sheet, enter the date(s) of calibration.  If the PT items were circulated independently for greater independent evaluations, there will be different dates for each item.  It items were circulated together, the dates will be the same."]
[8,"On the DataEntry sheet, enter the reported measurement result and associated uncertainty as reported by the metrologist.  Make sure units are consistently reported (convert to standard units if needed and verify conversion with the metrologist). The PT Plan should have established the values and units to be reported for helping with analysis consistency."]
[9,"Adjust the AXIS on the YoudenGraph sheet if/as needed and make sure the circle looks \"circular\".  Try to ensure consistent X and Y axis formatting.  E.g., the template sample data for the 10 kg standards shows -15 mg to + 15 mg on both the X and Y axis.  This is a scatter plot graph and the circle calculations are included in this template. A separate reference paper and associated PPT presentation are available that describe the calculations associated with this specialty PT analysis graph. NOTE: if you pressed the Clear Data button and the data was deleted, there will be no 45 degree diagonal line to show systematic offsets, no circle, and no data when you review the YoudenGraph worksheet.  If you have already entered data, it will show on the subsequent worksheets. "]
[10,"When the analysis is complete and you are ready to incorporate the analysis with the PT Final Report, select your PRINTER (PDF) (File, Print, dropdown for printer).  Then, on the DataEntry sheet, press the PRINT Data Sheet button on the DataEntry sheet (you will need to name the file).  Then, Print Youden Graph to PDF with another file name (e.g., add \"a\" or \"b\" to the end of the file name as needed), to compile the PDF pages with the PT Plan Report cover pages, and the PT Analysis report pages, to create the Final PT Report. The DataEntry sheet, Line Graphs, and Calculations are not needed when the usual PT Analysis template is used that includes line graphs."]
[11]
[12]
[13]

{"sheet":"DataEntry","index":2,"n_rows":39,"n_cols":18,"rows_kept":39,"cut":false,"hidden":false,"merged":[]}
["Data Entry Form for Youden Analysis",null,null,null,"Printing Note",null,null,null,null,"Are NIST Values Available?","no",null,null,null,null,null,{"$f":"Title&\" (\"&TEXT(R2,\"mmm d, yy\")&\" thru \"&TEXT(Q2,\"mmm d, yy\")&\")\"","v":"RMAP (Jan 1, 00 thru Oct 1, 00)"}]
[null,null,null,null,null,null,null,null,null,null,null,null,null,null,null,null,{"$f":"MAX(C10:C39,F10:F39)","v":"2000-10-01"},{"$f":"MIN(C10:C39,F10:F39)","v":"2000-01-01"}]
["RMAP Group:","RMAP",null,null,null,null,null,null,null,{"$f":"IF(K1=\"yes\",\"NIST \"&B4&\" Value =\",\"\")","v":""},0]
["PT Item #1:","10 kg #1",null,null,null,null,null,null,null,{"$f":"IF(K1=\"yes\",\"NIST \"&B4&\" Unc =\",\"\")","v":""},2.1]
["PT Item #2:","10 kg #2"]
["Tolerance:",23,null,null,null,null,null,null,null,{"$f":"IF(K1=\"yes\",\"NIST \"&B5&\" Value =\",\"\")","v":""},0]
["Data Analyzed Using:","Median",null,null,null,null,null,null,null,{"$f":"IF(K1=\"yes\",\"NIST \"&B5&\" Unc =\",\"\")","v":""},2.1]
["Units:","milligrams"]
[null,"Metrologist",{"$f":"\"Date \"&B4","v":"Date 10 kg #1"},{"$f":"B4","v":"10 kg #1"},{"$f":"\"Unc \"&B4","v":"Unc 10 kg #1"},{"$f":"\"Date \"&B5","v":"Date 10 kg #2"},{"$f":"B5","v":"10 kg #2"},{"$f":"\"Unc \"&B5","v":"Unc 10 kg #2"},null,"Ave Unc"]
[1,"A","2000-01-01",-2,5,"2000-09-28",-7,5,null,{"$f":"IF(AND(E10>0,H10>0),AVERAGE(E10,H10),\"\")","v":5}]
[2,"B","2000-01-15",1,8,"2000-08-15",-3,8,null,{"$f":"IF(AND(E11>0,H11>0),AVERAGE(E11,H11),\"\")","v":8}]
[3,"C","2000-04-30",4,6,"2000-07-05",-8,6,null,6]
[4,"D","2000-05-05",3,4,"2000-05-15",9,4,null,4]
[5,"E","2000-07-07",2,2,"2000-04-15",-4,2,null,2]
[6,"F","2000-08-01",0,7,"2000-03-01",2,7,null,7]
[7,"G","2000-08-10",1,5,"2000-02-01",-1,5,null,5]
[8,"H","2000-10-01",2,9,"2000-01-15",-3,9,null,9]
[9,null,null,null,null,null,null,null,null,""]
[10,null,null,null,null,null,null,null,null,""]
[11,null,null,null,null,null,null,null,null,""]
[12,null,null,null,null,null,null,null,null,""]
[13,null,null,null,null,null,null,null,null,""]
[14,null,null,null,null,null,null,null,null,""]
[15,null,null,null,null,null,null,null,null,""]
[16,null,null,null,null,null,null,null,null,""]
[17,null,null,null,null,null,null,null,null,""]
[18,null,null,null,null,null,null,null,null,""]
[19,null,null,null,null,null,null,null,null,""]
[20,null,null,null,null,null,null,null,null,""]
[21,null,null,null,null,null,null,null,null,""]
[22,null,null,null,null,null,null,null,null,""]
[23,null,null,null,null,null,null,null,null,""]
[24,null,null,null,null,null,null,null,null,""]
[25,null,null,null,null,null,null,null,null,""]
[26,null,null,null,null,null,null,null,null,""]
[27,null,null,null,null,null,null,null,null,""]
[28,null,null,null,null,null,null,null,null,""]
[29,null,null,null,null,null,null,null,null,""]
[30,null,null,null,null,null,null,null,null,""]

{"sheet":"YoudenGraph","index":3,"n_rows":22,"n_cols":18,"rows_kept":22,"cut":false,"hidden":false,"merged":[[1,1,1,2],[2,1,2,2],[3,1,3,2],[4,1,4,2],[2,11,2,12],[3,11,3,12],[4,11,4,12],[1,3,1,5],[2,3,2,5],[3,3,3,5],[4,3,4,5]]}
[null,null,null,null,null,null,null,{"$f":"DataEntry!Q1","v":"RMAP (Jan 1, 00 thru Oct 1, 00)"}]
[null,{"$f":"YoudenCalculations!J10","v":"10 kg #1"},null,{"$f":"YoudenCalculations!K10","v":"10 kg #2"},null,null,null,null,null,null,{"$f":"\"(All values are in \"&DataEntry!B8&\")\"","v":"(All values are in milligrams)"}]
["Median",{"$f":"YoudenCalculations!J5","v":1.5},null,{"$f":"YoudenCalculations!K5","v":-3},null,null,null,null,null,null,"Youden sd =",{"$f":"YoudenCalculations!Q1","v":2.9199571150226551}]
["Mean",{"$f":"YoudenCalculations!J6","v":1.375},null,{"$f":"YoudenCalculations!K6","v":-1.875},null,null,null,null,null,null,"Circle Radius =",{"$f":"YoudenCalculations!Q2","v":7.1538949318055058}]
[{"$f":"YoudenCalculations!I7","v":""},{"$f":"YoudenCalculations!J7","v":""},null,{"$f":"YoudenCalculations!K7","v":""},null,null,null,null,null,null,"Circle Center =",{"$f":"DataEntry!B7","v":"Median"}]
[]
[{"$f":"YoudenCalculations!I10","v":"Metrologist"},{"$f":"YoudenCalculations!J10","v":"10 kg #1"},{"$f":"YoudenCalculations!K10","v":"10 kg #2"},{"$f":"YoudenCalculations!S10","v":"Unc"},{"$f":"YoudenCalculations!N10","v":"SYS"},{"$f":"YoudenCalculations!O10","v":"RAN"},{"$f":"YoudenCalculations!T10","v":"Unc Test"},null,{"$f":"IF(LineGraphData!S5>15,A7,\"\")","v":""},{"$f":"IF(LineGraphData!S5>15,B7,\"\")","v":""},{"$f":"IF(LineGraphData!S5>15,C7,\"\")","v":""},{"$f":"IF(LineGraphData!S5>15,D7,\"\")","v":""},{"$f":"IF(LineGraphData!S5>15,E7,\"\")","v":""},{"$f":"IF(LineGraphData!S5>15,F7,\"\")","v":""},{"$f":"IF(LineGraphData!S5>15,G7,\"\")","v":""}]
[{"$f":"YoudenCalculations!I11","v":"A"},{"$f":"YoudenCalculations!J11","v":-2},{"$f":"YoudenCalculations!K11","v":-7},{"$f":"YoudenCalculations!S11","v":5},{"$f":"YoudenCalculations!N11","v":-4.9828808497193675},{"$f":"YoudenCalculations!O11","v":0.33219205664795787},{"$f":"YoudenCalculations!T11","v":"Warning"},null,{"$f":"YoudenCalculations!I26","v":""},{"$f":"YoudenCalculations!J26","v":""},{"$f":"YoudenCalculations!K26","v":""},{"$f":"YoudenCalculations!S26","v":""},{"$f":"YoudenCalculations!N26","v":""},{"$f":"YoudenCalculations!O26","v":""},{"$f":"YoudenCalculations!T26","v":""},null,"OUT R&S","Both the random and systematic error exceed the uncertainty"]
[{"$f":"YoudenCalculations!I12","v":"B"},{"$f":"YoudenCalculations!J12","v":1},{"$f":"YoudenCalculations!K12","v":-3},{"$f":"YoudenCalculations!S12","v":8},{"$f":"YoudenCalculations!N12","v":-0.25},{"$f":"YoudenCalculations!O12","v":0.25000000000000006},{"$f":"YoudenCalculations!T12","v":"IN"},null,{"$f":"YoudenCalculations!I27","v":""},{"$f":"YoudenCalculations!J27","v":""},{"$f":"YoudenCalculations!K27","v":""},{"$f":"YoudenCalculations!S27","v":""},{"$f":"YoudenCalculations!N27","v":""},{"$f":"YoudenCalculations!O27","v":""},{"$f":"YoudenCalculations!T27","v":""},null,"OUT Sys","Only the systematic error exceeds the uncertainty"]
[{"$f":"YoudenCalculations!I13","v":"C"},{"$f":"YoudenCalculations!J13","v":4},{"$f":"YoudenCalculations!K13","v":-8},{"$f":"YoudenCalculations!S13","v":6},{"$f":"YoudenCalculations!N13","v":-1.3975424859373684},{"$f":"YoudenCalculations!O13","v":4.1926274578121063},{"$f":"YoudenCalculations!T13","v":"IN"},null,{"$f":"YoudenCalculations!I28","v":""},{"$f":"YoudenCalculations!J28","v":""},{"$f":"YoudenCalculations!K28","v":""},{"$f":"YoudenCalculations!S28","v":""},{"$f":"YoudenCalculations!N28","v":""},{"$f":"YoudenCalculations!O28","v":""},{"$f":"YoudenCalculations!T28","v":""},null,"OUT Ran","Only the random portion of the error exceeds the uncertainty"]
[{"$f":"YoudenCalculations!I14","v":"D"},{"$f":"YoudenCalculations!J14","v":3},{"$f":"YoudenCalculations!K14","v":9},{"$f":"YoudenCalculations!S14","v":4},{"$f":"YoudenCalculations!N14","v":6.8025299751268991},{"$f":"YoudenCalculations!O14","v":5.2908566473209229},{"$f":"YoudenCalculations!T14","v":"OUT R&S"},null,{"$f":"YoudenCalculations!I29","v":""},{"$f":"YoudenCalculations!J29","v":""},{"$f":"YoudenCalculations!K29","v":""},{"$f":"YoudenCalculations!S29","v":""},{"$f":"YoudenCalculations!N29","v":""},{"$f":"YoudenCalculations!O29","v":""},{"$f":"YoudenCalculations!T29","v":""},null,"Warning","Only the summation of the random and systematic errors exceed the uncertainty"]
[{"$f":"YoudenCalculations!I15","v":"E"},{"$f":"YoudenCalculations!J15","v":2},{"$f":"YoudenCalculations!K15","v":-4},{"$f":"YoudenCalculations!S15","v":2},{"$f":"YoudenCalculations!N15","v":-0.27950849718747373},{"$f":"YoudenCalculations!O15","v":0.83852549156242118},{"$f":"YoudenCalculations!T15","v":"IN"},null,{"$f":"YoudenCalculations!I30","v":""},{"$f":"YoudenCalculations!J30","v":""},{"$f":"YoudenCalculations!K30","v":""},{"$f":"YoudenCalculations!S30","v":""},{"$f":"YoudenCalculations!N30","v":""},{"$f":"YoudenCalculations!O30","v":""},{"$f":"YoudenCalculations!T30","v":""},null,"IN","The measurement process appears to be within control"]
[{"$f":"YoudenCalculations!I16","v":"F"},{"$f":"YoudenCalculations!J16","v":0},{"$f":"YoudenCalculations!K16","v":2},{"$f":"YoudenCalculations!S16","v":7},{"$f":"YoudenCalculations!N16","v":1.8270536390593461},{"$f":"YoudenCalculations!O16","v":3.3930996153959283},{"$f":"YoudenCalculations!T16","v":"IN"},null,{"$f":"YoudenCalculations!I31","v":""},{"$f":"YoudenCalculations!J31","v":""},{"$f":"YoudenCalculations!K31","v":""},{"$f":"YoudenCalculations!S31","v":""},{"$f":"YoudenCalculations!N31","v":""},{"$f":"YoudenCalculations!O31","v":""},{"$f":"YoudenCalculations!T31","v":""}]
[{"$f":"YoudenCalculations!I17","v":"G"},{"$f":"YoudenCalculations!J17","v":1},{"$f":"YoudenCalculations!K17","v":-1},{"$f":"YoudenCalculations!S17","v":5},{"$f":"YoudenCalculations!N17","v":0.7730823048033113},{"$f":"YoudenCalculations!O17","v":1.2884705080055192},{"$f":"YoudenCalculations!T17","v":"IN"},null,{"$f":"YoudenCalculations!I32","v":""},{"$f":"YoudenCalculations!J32","v":""},{"$f":"YoudenCalculations!K32","v":""},{"$f":"YoudenCalculations!S32","v":""},{"$f":"YoudenCalculations!N32","v":""},{"$f":"YoudenCalculations!O32","v":""},{"$f":"YoudenCalculations!T32","v":""}]
[{"$f":"YoudenCalculations!I18","v":"H"},{"$f":"YoudenCalculations!J18","v":2},{"$f":"YoudenCalculations!K18","v":-3},{"$f":"YoudenCalculations!S18","v":9},{"$f":"YoudenCalculations!N18","v":0.25},{"$f":"YoudenCalculations!O18","v":0.25000000000000006},{"$f":"YoudenCalculations!T18","v":"IN"},null,{"$f":"YoudenCalculations!I33","v":""},{"$f":"YoudenCalculations!J33","v":""},{"$f":"YoudenCalculations!K33","v":""},{"$f":"YoudenCalculations!S33","v":""},{"$f":"YoudenCalculations!N33","v":""},{"$f":"YoudenCalculations!O33","v":""},{"$f":"YoudenCalculations!T33","v":""}]
[{"$f":"YoudenCalculations!I19","v":""},{"$f":"YoudenCalculations!J19","v":""},{"$f":"YoudenCalculations!K19","v":""},{"$f":"YoudenCalculations!S19","v":""},{"$f":"YoudenCalculations!N19","v":""},{"$f":"YoudenCalculations!O19","v":""},{"$f":"YoudenCalculations!T19","v":""},null,{"$f":"YoudenCalculations!I34","v":""},{"$f":"YoudenCalculations!J34","v":""},{"$f":"YoudenCalculations!K34","v":""},{"$f":"YoudenCalculations!S34","v":""},{"$f":"YoudenCalculations!N34","v":""},{"$f":"YoudenCalculations!O34","v":""},{"$f":"YoudenCalculations!T34","v":""}]
[{"$f":"YoudenCalculations!I20","v":""},{"$f":"YoudenCalculations!J20","v":""},{"$f":"YoudenCalculations!K20","v":""},{"$f":"YoudenCalculations!S20","v":""},{"$f":"YoudenCalculations!N20","v":""},{"$f":"YoudenCalculations!O20","v":""},{"$f":"YoudenCalculations!T20","v":""},null,{"$f":"YoudenCalculations!I35","v":""},{"$f":"YoudenCalculations!J35","v":""},{"$f":"YoudenCalculations!K35","v":""},{"$f":"YoudenCalculations!S35","v":""},{"$f":"YoudenCalculations!N35","v":""},{"$f":"YoudenCalculations!O35","v":""},{"$f":"YoudenCalculations!T35","v":""}]
[{"$f":"YoudenCalculations!I21","v":""},{"$f":"YoudenCalculations!J21","v":""},{"$f":"YoudenCalculations!K21","v":""},{"$f":"YoudenCalculations!S21","v":""},{"$f":"YoudenCalculations!N21","v":""},{"$f":"YoudenCalculations!O21","v":""},{"$f":"YoudenCalculations!T21","v":""},null,{"$f":"YoudenCalculations!I36","v":""},{"$f":"YoudenCalculations!J36","v":""},{"$f":"YoudenCalculations!K36","v":""},{"$f":"YoudenCalculations!S36","v":""},{"$f":"YoudenCalculations!N36","v":""},{"$f":"YoudenCalculations!O36","v":""},{"$f":"YoudenCalculations!T36","v":""}]
[{"$f":"YoudenCalculations!I22","v":""},{"$f":"YoudenCalculations!J22","v":""},{"$f":"YoudenCalculations!K22","v":""},{"$f":"YoudenCalculations!S22","v":""},{"$f":"YoudenCalculations!N22","v":""},{"$f":"YoudenCalculations!O22","v":""},{"$f":"YoudenCalculations!T22","v":""},null,{"$f":"YoudenCalculations!I37","v":""},{"$f":"YoudenCalculations!J37","v":""},{"$f":"YoudenCalculations!K37","v":""},{"$f":"YoudenCalculations!S37","v":""},{"$f":"YoudenCalculations!N37","v":""},{"$f":"YoudenCalculations!O37","v":""},{"$f":"YoudenCalculations!T37","v":""}]
[{"$f":"YoudenCalculations!I23","v":""},{"$f":"YoudenCalculations!J23","v":""},{"$f":"YoudenCalculations!K23","v":""},{"$f":"YoudenCalculations!S23","v":""},{"$f":"YoudenCalculations!N23","v":""},{"$f":"YoudenCalculations!O23","v":""},{"$f":"YoudenCalculations!T23","v":""},null,{"$f":"YoudenCalculations!I38","v":""},{"$f":"YoudenCalculations!J38","v":""},{"$f":"YoudenCalculations!K38","v":""},{"$f":"YoudenCalculations!S38","v":""},{"$f":"YoudenCalculations!N38","v":""},{"$f":"YoudenCalculations!O38","v":""},{"$f":"YoudenCalculations!T38","v":""}]
[{"$f":"YoudenCalculations!I24","v":""},{"$f":"YoudenCalculations!J24","v":""},{"$f":"YoudenCalculations!K24","v":""},{"$f":"YoudenCalculations!S24","v":""},{"$f":"YoudenCalculations!N24","v":""},{"$f":"YoudenCalculations!O24","v":""},{"$f":"YoudenCalculations!T24","v":""},null,{"$f":"YoudenCalculations!I39","v":""},{"$f":"YoudenCalculations!J39","v":""},{"$f":"YoudenCalculations!K39","v":""},{"$f":"YoudenCalculations!S39","v":""},{"$f":"YoudenCalculations!N39","v":""},{"$f":"YoudenCalculations!O39","v":""},{"$f":"YoudenCalculations!T39","v":""}]
[{"$f":"YoudenCalculations!I25","v":""},{"$f":"YoudenCalculations!J25","v":""},{"$f":"YoudenCalculations!K25","v":""},{"$f":"YoudenCalculations!S25","v":""},{"$f":"YoudenCalculations!N25","v":""},{"$f":"YoudenCalculations!O25","v":""},{"$f":"YoudenCalculations!T25","v":""},null,{"$f":"YoudenCalculations!I40","v":""},{"$f":"YoudenCalculations!J40","v":""},{"$f":"YoudenCalculations!K40","v":""},{"$f":"YoudenCalculations!S40","v":""},{"$f":"YoudenCalculations!N40","v":""},{"$f":"YoudenCalculations!O40","v":""},{"$f":"YoudenCalculations!T40","v":""}]

{"sheet":"LineGraphs","index":4,"n_rows":0,"n_cols":0,"rows_kept":0,"cut":false,"hidden":false,"merged":[]}

{"sheet":"LineGraphData","index":5,"n_rows":46,"n_cols":48,"rows_kept":46,"cut":false,"hidden":false,"merged":[[4,1,4,2],[4,3,4,4],[3,1,3,2],[1,1,1,2],[2,1,2,2],[1,3,1,4],[2,3,2,4],[3,3,3,4]]}
[null,null,null,null,null,{"$f":"DataEntry!Q1","v":"RMAP (Jan 1, 00 thru Oct 1, 00)"},null,null,null,null,null,null,null,null,null,null,null,null,{"$f":"DataEntry!B7","v":"Median"},{"$f":"DataEntry!B7","v":"Median"},null,null,{"$f":"DataEntry!Q1&\" \"&C16&\" (analyzed versus \"&S1&\")\"","v":"RMAP (Jan 1, 00 thru Oct 1, 00) 10 kg #1 (analyzed versus Median)"},null,null,null,null,null,null,null,null,{"$f":"DataEntry!Q1&\" \"&I16&\" (analyzed versus \"&T1&\")\"","v":"RMAP (Jan 1, 00 thru Oct 1, 00) 10 kg #2 (analyzed versus Median)"},null,null,null,null,null,null,null,{"$f":"DataEntry!Q1&\" Enormal Test (must be <1)\"","v":"RMAP (Jan 1, 00 thru Oct 1, 00) Enormal Test (must be <1)"}]
[null,{"$f":"DataEntry!B4","v":"10 kg #1"},null,{"$f":"DataEntry!B5","v":"10 kg #2"},null,null,null,null,null,null,{"$f":"\"(All values are in \"&DataEntry!B8&\")\"","v":"(All values are in milligrams)"},null,null,null,null,null,null,"Old 2sd =",{"$f":"STDEV(C17:C46)*2","v":3.6936238496708271},{"$f":"STDEV(I17:I46)*2","v":10.819955109492302},null,null,null,{"$f":"C16&\" Enormal\"","v":"10 kg #1 Enormal"}]
["Median",{"$f":"YoudenCalculations!J5","v":1.5},null,{"$f":"YoudenCalculations!K5","v":-3},null,null,null,null,{"$f":"DataEntry!B7&\" Value \"&B2&\" =\"","v":"Median Value 10 kg #1 ="},{"$f":"YoudenCalculations!J1","v":1.5},{"$f":"\"n=\"&S5","v":"n=8"},null,null,null,null,null,null,"New 2sd=",{"$f":"STDEV(S17:S46)*2","v":3.6936238496708271},{"$f":"STDEV(T17:T46)*2","v":6.817344825970773},null,null,null,null,null,null,null,null,null,null,null,null,null,null,null,null,null,null,null,null,null,null,null,null,{"$f":"DataEntry!Q1&\" Precision Ratio (must be >3)\"","v":"RMAP (Jan 1, 00 thru Oct 1, 00) Precision Ratio (must be >3)"}]
["Mean",{"$f":"YoudenCalculations!J6","v":1.375},null,{"$f":"YoudenCalculations!K6","v":-1.875},null,null,null,null,{"$f":"DataEntry!B7&\" Unc \"&B2&\" =\"","v":"Median Unc 10 kg #1 ="},{"$f":"YoudenCalculations!J2","v":3.6936238496708271},{"$f":"\"n=\"&S5","v":"n=8"},null,null,null,null,null,null,"New Value =",{"$f":"IF(S1=\"NIST\",B5,IF(S1=\"Median\",MEDIAN(S17:S46),IF(S1=\"Mean\",AVERAGE(S17:S46),\"INPUT ERROR\")))","v":1.5},{"$f":"IF(T1=\"NIST\",D5,IF(T1=\"Median\",MEDIAN(T17:T46),IF(T1=\"Mean\",AVERAGE(T17:T46),\"INPUT ERROR\")))","v":-3}]
[{"$f":"YoudenCalculations!I7","v":""},{"$f":"YoudenCalculations!J7","v":""},null,{"$f":"YoudenCalculations!K7","v":""},null,null,null,null,{"$f":"\"New \"&DataEntry!B7&\" Value \"&B2&\" =\"","v":"New Median Value 10 kg #1 ="},{"$f":"IF($S$1=\"NIST\",B5,S4)","v":1.5},{"$f":"\"n=\"&S6","v":"n=8"},null,null,null,null,null,null,null,{"$f":"COUNT(DataEntry!D10:D39)","v":8},{"$f":"COUNT(DataEntry!E10:E39)","v":8}]
[null,null,null,null,null,null,null,null,{"$f":"\"New \"&DataEntry!B7&\" Unc \"&B2&\" =\"","v":"New Median Unc 10 kg #1 ="},{"$f":"IF($S$1=\"NIST\",J4,S3)","v":3.6936238496708271},{"$f":"\"n=\"&S6","v":"n=8"},null,null,null,null,null,null,null,{"$f":"COUNT(S17:S46)","v":8},{"$f":"COUNT(T17:T46)","v":7}]
[]
[null,null,null,null,null,null,null,null,{"$f":"DataEntry!B7&\" Value \"&D2&\" =\"","v":"Median Value 10 kg #2 ="},{"$f":"YoudenCalculations!K1","v":-3},{"$f":"\"n=\"&T5","v":"n=8"}]
[null,null,null,null,null,null,null,null,{"$f":"DataEntry!B7&\" Unc \"&D2&\" =\"","v":"Median Unc 10 kg #2 ="},{"$f":"YoudenCalculations!K2","v":10.819955109492302},{"$f":"\"n=\"&T5","v":"n=8"}]
[null,null,null,null,null,null,null,null,{"$f":"\"New \"&DataEntry!B7&\" Value \"&D2&\" =\"","v":"New Median Value 10 kg #2 ="},{"$f":"IF($S$1=\"NIST\",D5,T4)","v":-3},{"$f":"\"n=\"&T6","v":"n=7"}]
[null,null,null,null,null,null,null,null,{"$f":"\"New \"&DataEntry!B7&\" Unc \"&D2&\" =\"","v":"New Median Unc 10 kg #2 ="},{"$f":"IF($S$1=\"NIST\",J9,T3)","v":6.817344825970773},{"$f":"\"n=\"&T6","v":"n=7"}]
[]
[]
[{"$f":"DataEntry!A6","v":"Tolerance:"},{"$f":"DataEntry!B6","v":23},null,null,null,{"$f":"\"Data Analyzed versus the \"&DataEntry!B7&\" values\"","v":"Data Analyzed versus the Median values"}]
[null,null,null,null,"<1","<1",null,null,null,null,"<1","<1"]
[{"$f":"YoudenCalculations!I10","v":"Metrologist"},"Date",{"$f":"YoudenCalculations!J10","v":"10 kg #1"},{"$f":"DataEntry!E9","v":"Unc 10 kg #1"},{"$f":"\"En \"&C16","v":"En 10 kg #1"},{"$f":"\"Pn \"&C16","v":"Pn 10 kg #1"},"Out 2sd","Date",{"$f":"YoudenCalculations!K10","v":"10 kg #2"},{"$f":"DataEntry!H9","v":"Unc 10 kg #2"},{"$f":"\"En \"&I16","v":"En 10 kg #2"},{"$f":"\"Pn \"&I16","v":"Pn 10 kg #2"},"Out 2sd",null,null,null,null,null,{"$f":"C16","v":"10 kg #1"},{"$f":"I16","v":"10 kg #2"},null,{"$f":"A16","v":"Metrologist"},"Date",{"$f":"C16","v":"10 kg #1"},{"$f":"D16","v":"Unc 10 kg #1"},{"$f":"S1","v":"Median"},{"$f":"Z16&\" Unc\"","v":"Median Unc"},{"$f":"AA16","v":"Median Unc"},null,null,{"$f":"A16","v":"Metrologist"},"Date",{"$f":"I16","v":"10 kg #2"},{"$f":"J16","v":"Unc 10 kg #2"},{"$f":"T1","v":"Median"},{"$f":"AI16&\" Unc\"","v":"Median Unc"},{"$f":"AI16&\" Unc\"","v":"Median Unc"},null,null,{"$f":"A16","v":"Metrologist"},{"$f":"E16","v":"En 10 kg #1"},{"$f":"K16","v":"En 10 kg #2"},"EnLimit",null,{"$f":"A16","v":"Metrologist"},{"$f":"F16","v":"Pn 10 kg #1"},{"$f":"L16","v":"Pn 10 kg #2"},"PrLimit"]
[{"$f":"YoudenCalculations!I11","v":"A"},{"$f":"IF(DataEntry!E10>0,DataEntry!C10,\"\")","v":"2000-01-01"},{"$f":"YoudenCalculations!J11","v":-2},{"$f":"IF(DataEntry!E10>0,DataEntry!E10,\"\")","v":5},{"$f":"IF(DataEntry!E10>0,ABS(C17-YoudenCalculations!$J$1)/SQRT(D17^2+$J$6^2),\"\")","v":0.56303245491401865},{"$f":"IF(DataEntry!E10>0,D17/$B$14,\"\")","v":0.21739130434782608},{"$f":"IF(DataEntry!E10>0,IF(ABS(C17-YoudenCalculations!$J$1)>$S$2,\"yes\",\"\"),\"\")","v":""},{"$f":"IF(DataEntry!H10>0,DataEntry!F10,\"\")","v":"2000-09-28"},{"$f":"YoudenCalculations!K11","v":-7},{"$f":"IF(DataEntry!H10>0,DataEntry!H10,\"\")","v":5},{"$f":"IF(DataEntry!H10>0,ABS(I17-YoudenCalculations!$K$1)/SQRT(J17^2+$J$11^2),\"\")","v":0.47312869935768653},{"$f":"IF(DataEntry!H10>0,J17/$B$14,\"\")","v":0.21739130434782608},{"$f":"IF(DataEntry!H10>0,IF(ABS(I17-YoudenCalculations!$K$1)>$T$2,\"yes\",\"\"),\"\")","v":""},null,null,null,null,null,{"$f":"IF(DataEntry!E10>0,IF(G17=\"yes\",\"\",C17),\"\")","v":-2},{"$f":"IF(DataEntry!E10>0,IF(M17=\"yes\",\"\",I17),\"\")","v":-7},1,{"$f":"IF(DataEntry!E10>0,DataEntry!B10,#N/A)","v":"A"},{"$f":"IF(DataEntry!E10>0,DataEntry!C10,#N/A)","v":"2000-01-01"},{"$f":"IF(DataEntry!E10>0,DataEntry!D10,#N/A)","v":-2},{"$f":"IF(DataEntry!E10>0,DataEntry!E10,#N/A)","v":5},{"$f":"IF(DataEntry!E10>0,$J$5,#N/A)","v":1.5},{"$f":"Z17+$J$6","v":5.1936238496708267},{"$f":"Z17-$J$6","v":-2.1936238496708271},null,null,{"$f":"IF(DataEntry!H10>0,DataEntry!B10,#N/A)","v":"A"},{"$f":"IF(DataEntry!H10>0,DataEntry!F10,#N/A)","v":"2000-09-28"},{"$f":"IF(DataEntry!H10>0,DataEntry!G10,#N/A)","v":-7},{"$f":"IF(DataEntry!H10>0,DataEntry!H10,#N/A)","v":5},{"$f":"IF(DataEntry!H10>0,$J$10,#N/A)","v":-3},{"$f":"AI17+$J$11","v":3.817344825970773},{"$f":"AI17-$J$11","v":-9.817344825970773},null,null,{"$f":"IF(DataEntry!E10>0,A17,\"\")","v":"A"},{"$f":"IF(DataEntry!E10>0,E17,#N/A)","v":0.56303245491401865},{"$f":"IF(DataEntry!H10>0,K17,#N/A)","v":0.47312869935768653},{"$f":"IF(DataEntry!H10>0,1,#N/A)","v":1},null,{"$f":"IF(DataEntry!E10>0,A17,\"\")","v":"A"},{"$f":"IF(DataEntry!E10>0,F17,#N/A)","v":0.21739130434782608},{"$f":"IF(DataEntry!H10>0,L17,#N/A)","v":0.21739130434782608},{"$f":"IF(DataEntry!H10>0,3,#N/A)","v":3}]
[{"$f":"YoudenCalculations!I12","v":"B"},{"$f":"IF(DataEntry!E11>0,DataEntry!C11,\"\")","v":"2000-01-15"},{"$f":"YoudenCalculations!J12","v":1},{"$f":"IF(DataEntry!E11>0,DataEntry!E11,\"\")","v":8},{"$f":"IF(DataEntry!E11>0,ABS(C18-YoudenCalculations!$J$1)/SQRT(D18^2+$J$6^2),\"\")","v":5.67439089696136E-2},{"$f":"IF(DataEntry!E11>0,D18/$B$14,\"\")","v":0.34782608695652173},{"$f":"IF(DataEntry!E11>0,IF(ABS(C18-YoudenCalculations!$J$1)>$S$2,\"yes\",\"\"),\"\")","v":""},{"$f":"IF(DataEntry!H11>0,DataEntry!F11,\"\")","v":"2000-08-15"},{"$f":"YoudenCalculations!K12","v":-3},{"$f":"IF(DataEntry!H11>0,DataEntry!H11,\"\")","v":8},{"$f":"IF(DataEntry!H11>0,ABS(I18-YoudenCalculations!$K$1)/SQRT(J18^2+$J$11^2),\"\")","v":0},{"$f":"IF(DataEntry!H11>0,J18/$B$14,\"\")","v":0.34782608695652173},{"$f":"IF(DataEntry!H11>0,IF(ABS(I18-YoudenCalculations!$K$1)>$T$2,\"yes\",\"\"),\"\")","v":""},null,null,null,null,null,{"$f":"IF(DataEntry!E11>0,IF(G18=\"yes\",\"\",C18),\"\")","v":1},{"$f":"IF(DataEntry!E11>0,IF(M18=\"yes\",\"\",I18),\"\")","v":-3},2,{"$f":"IF(DataEntry!E11>0,DataEntry!B11,#N/A)","v":"B"},{"$f":"IF(DataEntry!E11>0,DataEntry!C11,#N/A)","v":"2000-01-15"},{"$f":"IF(DataEntry!E11>0,DataEntry!D11,#N/A)","v":1},{"$f":"IF(DataEntry!E11>0,DataEntry!E11,#N/A)","v":8},{"$f":"IF(DataEntry!E11>0,$J$5,#N/A)","v":1.5},{"$f":"Z18+$J$6","v":5.1936238496708267},{"$f":"Z18-$J$6","v":-2.1936238496708271},null,null,{"$f":"IF(DataEntry!H11>0,DataEntry!B11,#N/A)","v":"B"},{"$f":"IF(DataEntry!H11>0,DataEntry!F11,#N/A)","v":"2000-08-15"},{"$f":"IF(DataEntry!H11>0,DataEntry!G11,#N/A)","v":-3},{"$f":"IF(DataEntry!H11>0,DataEntry!H11,#N/A)","v":8},{"$f":"IF(DataEntry!H11>0,$J$10,#N/A)","v":-3},{"$f":"AI18+$J$11","v":3.817344825970773},{"$f":"AI18-$J$11","v":-9.817344825970773},null,null,{"$f":"IF(DataEntry!E11>0,A18,\"\")","v":"B"},{"$f":"IF(DataEntry!E11>0,E18,#N/A)","v":5.67439089696136E-2},{"$f":"IF(DataEntry!H11>0,K18,#N/A)","v":0},{"$f":"IF(DataEntry!H11>0,1,#N/A)","v":1},null,{"$f":"IF(DataEntry!E11>0,A18,\"\")","v":"B"},{"$f":"IF(DataEntry!E11>0,F18,#N/A)","v":0.34782608695652173},{"$f":"IF(DataEntry!H11>0,L18,#N/A)","v":0.34782608695652173},{"$f":"IF(DataEntry!H11>0,3,#N/A)","v":3}]
[{"$f":"YoudenCalculations!I13","v":"C"},{"$f":"IF(DataEntry!E12>0,DataEntry!C12,\"\")","v":"2000-04-30"},{"$f":"YoudenCalculations!J13","v":4},{"$f":"IF(DataEntry!E12>0,DataEntry!E12,\"\")","v":6},{"$f":"IF(DataEntry!E12>0,ABS(C19-YoudenCalculations!$J$1)/SQRT(D19^2+$J$6^2),\"\")","v":0.3548228862059768},{"$f":"IF(DataEntry!E12>0,D19/$B$14,\"\")","v":0.2608695652173913},{"$f":"IF(DataEntry!E12>0,IF(ABS(C19-YoudenCalculations!$J$1)>$S$2,\"yes\",\"\"),\"\")","v":""},{"$f":"IF(DataEntry!H12>0,DataEntry!F12,\"\")","v":"2000-07-05"},{"$f":"YoudenCalculations!K13","v":-8},{"$f":"IF(DataEntry!H12>0,DataEntry!H12,\"\")","v":6},{"$f":"IF(DataEntry!H12>0,ABS(I19-YoudenCalculations!$K$1)/SQRT(J19^2+$J$11^2),\"\")","v":0.5505613343760446},{"$f":"IF(DataEntry!H12>0,J19/$B$14,\"\")","v":0.2608695652173913},{"$f":"IF(DataEntry!H12>0,IF(ABS(I19-YoudenCalculations!$K$1)>$T$2,\"yes\",\"\"),\"\")","v":""},null,null,null,null,null,{"$f":"IF(DataEntry!E12>0,IF(G19=\"yes\",\"\",C19),\"\")","v":4},{"$f":"IF(DataEntry!E12>0,IF(M19=\"yes\",\"\",I19),\"\")","v":-8},3,{"$f":"IF(DataEntry!E12>0,DataEntry!B12,#N/A)","v":"C"},{"$f":"IF(DataEntry!E12>0,DataEntry!C12,#N/A)","v":"2000-04-30"},{"$f":"IF(DataEntry!E12>0,DataEntry!D12,#N/A)","v":4},{"$f":"IF(DataEntry!E12>0,DataEntry!E12,#N/A)","v":6},{"$f":"IF(DataEntry!E12>0,$J$5,#N/A)","v":1.5},5.1936238496708267,-2.1936238496708271,null,null,{"$f":"IF(DataEntry!H12>0,DataEntry!B12,#N/A)","v":"C"},{"$f":"IF(DataEntry!H12>0,DataEntry!F12,#N/A)","v":"2000-07-05"},{"$f":"IF(DataEntry!H12>0,DataEntry!G12,#N/A)","v":-8},{"$f":"IF(DataEntry!H12>0,DataEntry!H12,#N/A)","v":6},{"$f":"IF(DataEntry!H12>0,$J$10,#N/A)","v":-3},3.817344825970773,-9.817344825970773,null,null,{"$f":"IF(DataEntry!E12>0,A19,\"\")","v":"C"},{"$f":"IF(DataEntry!E12>0,E19,#N/A)","v":0.3548228862059768},{"$f":"IF(DataEntry!H12>0,K19,#N/A)","v":0.5505613343760446},{"$f":"IF(DataEntry!H12>0,1,#N/A)","v":1},null,{"$f":"IF(DataEntry!E12>0,A19,\"\")","v":"C"},{"$f":"IF(DataEntry!E12>0,F19,#N/A)","v":0.2608695652173913},{"$f":"IF(DataEntry!H12>0,L19,#N/A)","v":0.2608695652173913},{"$f":"IF(DataEntry!H12>0,3,#N/A)","v":3}]
[{"$f":"YoudenCalculations!I14","v":"D"},{"$f":"IF(DataEntry!E13>0,DataEntry!C13,\"\")","v":"2000-05-05"},{"$f":"YoudenCalculations!J14","v":3},{"$f":"IF(DataEntry!E13>0,DataEntry!E13,\"\")","v":4},{"$f":"IF(DataEntry!E13>0,ABS(C20-YoudenCalculations!$J$1)/SQRT(D20^2+$J$6^2),\"\")","v":0.27550610602640252},{"$f":"IF(DataEntry!E13>0,D20/$B$14,\"\")","v":0.17391304347826086},{"$f":"IF(DataEntry!E13>0,IF(ABS(C20-YoudenCalculations!$J$1)>$S$2,\"yes\",\"\"),\"\")","v":""},{"$f":"IF(DataEntry!H13>0,DataEntry!F13,\"\")","v":"2000-05-15"},{"$f":"YoudenCalculations!K14","v":9},{"$f":"IF(DataEntry!H13>0,DataEntry!H13,\"\")","v":4},{"$f":"IF(DataEntry!H13>0,ABS(I20-YoudenCalculations!$K$1)/SQRT(J20^2+$J$11^2),\"\")","v":1.5181824820424217},{"$f":"IF(DataEntry!H13>0,J20/$B$14,\"\")","v":0.17391304347826086},{"$f":"IF(DataEntry!H13>0,IF(ABS(I20-YoudenCalculations!$K$1)>$T$2,\"yes\",\"\"),\"\")","v":"yes"},null,null,null,null,null,{"$f":"IF(DataEntry!E13>0,IF(G20=\"yes\",\"\",C20),\"\")","v":3},{"$f":"IF(DataEntry!E13>0,IF(M20=\"yes\",\"\",I20),\"\")","v":""},4,{"$f":"IF(DataEntry!E13>0,DataEntry!B13,#N/A)","v":"D"},{"$f":"IF(DataEntry!E13>0,DataEntry!C13,#N/A)","v":"2000-05-05"},{"$f":"IF(DataEntry!E13>0,DataEntry!D13,#N/A)","v":3},{"$f":"IF(DataEntry!E13>0,DataEntry!E13,#N/A)","v":4},{"$f":"IF(DataEntry!E13>0,$J$5,#N/A)","v":1.5},5.1936238496708267,-2.1936238496708271,null,null,{"$f":"IF(DataEntry!H13>0,DataEntry!B13,#N/A)","v":"D"},{"$f":"IF(DataEntry!H13>0,DataEntry!F13,#N/A)","v":"2000-05-15"},{"$f":"IF(DataEntry!H13>0,DataEntry!G13,#N/A)","v":9},{"$f":"IF(DataEntry!H13>0,DataEntry!H13,#N/A)","v":4},{"$f":"IF(DataEntry!H13>0,$J$10,#N/A)","v":-3},3.817344825970773,-9.817344825970773,null,null,{"$f":"IF(DataEntry!E13>0,A20,\"\")","v":"D"},{"$f":"IF(DataEntry!E13>0,E20,#N/A)","v":0.27550610602640252},{"$f":"IF(DataEntry!H13>0,K20,#N/A)","v":1.5181824820424217},{"$f":"IF(DataEntry!H13>0,1,#N/A)","v":1},null,{"$f":"IF(DataEntry!E13>0,A20,\"\")","v":"D"},{"$f":"IF(DataEntry!E13>0,F20,#N/A)","v":0.17391304347826086},{"$f":"IF(DataEntry!H13>0,L20,#N/A)","v":0.17391304347826086},{"$f":"IF(DataEntry!H13>0,3,#N/A)","v":3}]
[{"$f":"YoudenCalculations!I15","v":"E"},{"$f":"IF(DataEntry!E14>0,DataEntry!C14,\"\")","v":"2000-07-07"},{"$f":"YoudenCalculations!J15","v":2},{"$f":"IF(DataEntry!E14>0,DataEntry!E14,\"\")","v":2},{"$f":"IF(DataEntry!E14>0,ABS(C21-YoudenCalculations!$J$1)/SQRT(D21^2+$J$6^2),\"\")","v":0.11903797917400127},{"$f":"IF(DataEntry!E14>0,D21/$B$14,\"\")","v":8.6956521739130432E-2},{"$f":"IF(DataEntry!E14>0,IF(ABS(C21-YoudenCalculations!$J$1)>$S$2,\"yes\",\"\"),\"\")","v":""},{"$f":"IF(DataEntry!H14>0,DataEntry!F14,\"\")","v":"2000-04-15"},{"$f":"YoudenCalculations!K15","v":-4},{"$f":"IF(DataEntry!H14>0,DataEntry!H14,\"\")","v":2},{"$f":"IF(DataEntry!H14>0,ABS(I21-YoudenCalculations!$K$1)/SQRT(J21^2+$J$11^2),\"\")","v":0.14075269359666615},{"$f":"IF(DataEntry!H14>0,J21/$B$14,\"\")","v":8.6956521739130432E-2},{"$f":"IF(DataEntry!H14>0,IF(ABS(I21-YoudenCalculations!$K$1)>$T$2,\"yes\",\"\"),\"\")","v":""},null,null,null,null,null,{"$f":"IF(DataEntry!E14>0,IF(G21=\"yes\",\"\",C21),\"\")","v":2},{"$f":"IF(DataEntry!E14>0,IF(M21=\"yes\",\"\",I21),\"\")","v":-4},5,{"$f":"IF(DataEntry!E14>0,DataEntry!B14,#N/A)","v":"E"},{"$f":"IF(DataEntry!E14>0,DataEntry!C14,#N/A)","v":"2000-07-07"},{"$f":"IF(DataEntry!E14>0,DataEntry!D14,#N/A)","v":2},{"$f":"IF(DataEntry!E14>0,DataEntry!E14,#N/A)","v":2},{"$f":"IF(DataEntry!E14>0,$J$5,#N/A)","v":1.5},5.1936238496708267,-2.1936238496708271,null,null,{"$f":"IF(DataEntry!H14>0,DataEntry!B14,#N/A)","v":"E"},{"$f":"IF(DataEntry!H14>0,DataEntry!F14,#N/A)","v":"2000-04-15"},{"$f":"IF(DataEntry!H14>0,DataEntry!G14,#N/A)","v":-4},{"$f":"IF(DataEntry!H14>0,DataEntry!H14,#N/A)","v":2},{"$f":"IF(DataEntry!H14>0,$J$10,#N/A)","v":-3},3.817344825970773,-9.817344825970773,null,null,{"$f":"IF(DataEntry!E14>0,A21,\"\")","v":"E"},{"$f":"IF(DataEntry!E14>0,E21,#N/A)","v":0.11903797917400127},{"$f":"IF(DataEntry!H14>0,K21,#N/A)","v":0.14075269359666615},{"$f":"IF(DataEntry!H14>0,1,#N/A)","v":1},null,{"$f":"IF(DataEntry!E14>0,A21,\"\")","v":"E"},{"$f":"IF(DataEntry!E14>0,F21,#N/A)","v":8.6956521739130432E-2},{"$f":"IF(DataEntry!H14>0,L21,#N/A)","v":8.6956521739130432E-2},{"$f":"IF(DataEntry!H14>0,3,#N/A)","v":3}]
[{"$f":"YoudenCalculations!I16","v":"F"},{"$f":"IF(DataEntry!E15>0,DataEntry!C15,\"\")","v":"2000-08-01"},{"$f":"YoudenCalculations!J16","v":0},{"$f":"IF(DataEntry!E15>0,DataEntry!E15,\"\")","v":7},{"$f":"IF(DataEntry!E15>0,ABS(C22-YoudenCalculations!$J$1)/SQRT(D22^2+$J$6^2),\"\")","v":0.18952018873572932},{"$f":"IF(DataEntry!E15>0,D22/$B$14,\"\")","v":0.30434782608695654},{"$f":"IF(DataEntry!E15>0,IF(ABS(C22-YoudenCalculations!$J$1)>$S$2,\"yes\",\"\"),\"\")","v":""},{"$f":"IF(DataEntry!H15>0,DataEntry!F15,\"\")","v":"2000-03-01"},{"$f":"YoudenCalculations!K16","v":2},{"$f":"IF(DataEntry!H15>0,DataEntry!H15,\"\")","v":7},{"$f":"IF(DataEntry!H15>0,ABS(I22-YoudenCalculations!$K$1)/SQRT(J22^2+$J$11^2),\"\")","v":0.51170830219341357},{"$f":"IF(DataEntry!H15>0,J22/$B$14,\"\")","v":0.30434782608695654},{"$f":"IF(DataEntry!H15>0,IF(ABS(I22-YoudenCalculations!$K$1)>$T$2,\"yes\",\"\"),\"\")","v":""},null,null,null,null,null,{"$f":"IF(DataEntry!E15>0,IF(G22=\"yes\",\"\",C22),\"\")","v":0},{"$f":"IF(DataEntry!E15>0,IF(M22=\"yes\",\"\",I22),\"\")","v":2},6,{"$f":"IF(DataEntry!E15>0,DataEntry!B15,#N/A)","v":"F"},{"$f":"IF(DataEntry!E15>0,DataEntry!C15,#N/A)","v":"2000-08-01"},{"$f":"IF(DataEntry!E15>0,DataEntry!D15,#N/A)","v":0},{"$f":"IF(DataEntry!E15>0,DataEntry!E15,#N/A)","v":7},{"$f":"IF(DataEntry!E15>0,$J$5,#N/A)","v":1.5},5.1936238496708267,-2.1936238496708271,null,null,{"$f":"IF(DataEntry!H15>0,DataEntry!B15,#N/A)","v":"F"},{"$f":"IF(DataEntry!H15>0,DataEntry!F15,#N/A)","v":"2000-03-01"},{"$f":"IF(DataEntry!H15>0,DataEntry!G15,#N/A)","v":2},{"$f":"IF(DataEntry!H15>0,DataEntry!H15,#N/A)","v":7},{"$f":"IF(DataEntry!H15>0,$J$10,#N/A)","v":-3},3.817344825970773,-9.817344825970773,null,null,{"$f":"IF(DataEntry!E15>0,A22,\"\")","v":"F"},{"$f":"IF(DataEntry!E15>0,E22,#N/A)","v":0.18952018873572932},{"$f":"IF(DataEntry!H15>0,K22,#N/A)","v":0.51170830219341357},{"$f":"IF(DataEntry!H15>0,1,#N/A)","v":1},null,{"$f":"IF(DataEntry!E15>0,A22,\"\")","v":"F"},{"$f":"IF(DataEntry!E15>0,F22,#N/A)","v":0.30434782608695654},{"$f":"IF(DataEntry!H15>0,L22,#N/A)","v":0.30434782608695654},{"$f":"IF(DataEntry!H15>0,3,#N/A)","v":3}]
[{"$f":"YoudenCalculations!I17","v":"G"},{"$f":"IF(DataEntry!E16>0,DataEntry!C16,\"\")","v":"2000-08-10"},{"$f":"YoudenCalculations!J17","v":1},{"$f":"IF(DataEntry!E16>0,DataEntry!E16,\"\")","v":5},{"$f":"IF(DataEntry!E16>0,ABS(C23-YoudenCalculations!$J$1)/SQRT(D23^2+$J$6^2),\"\")","v":8.0433207844859814E-2},{"$f":"IF(DataEntry!E16>0,D23/$B$14,\"\")","v":0.21739130434782608},{"$f":"IF(DataEntry!E16>0,IF(ABS(C23-YoudenCalculations!$J$1)>$S$2,\"yes\",\"\"),\"\")","v":""},{"$f":"IF(DataEntry!H16>0,DataEntry!F16,\"\")","v":"2000-02-01"},{"$f":"YoudenCalculations!K17","v":-1},{"$f":"IF(DataEntry!H16>0,DataEntry!H16,\"\")","v":5},{"$f":"IF(DataEntry!H16>0,ABS(I23-YoudenCalculations!$K$1)/SQRT(J23^2+$J$11^2),\"\")","v":0.23656434967884327},{"$f":"IF(DataEntry!H16>0,J23/$B$14,\"\")","v":0.21739130434782608},{"$f":"IF(DataEntry!H16>0,IF(ABS(I23-YoudenCalculations!$K$1)>$T$2,\"yes\",\"\"),\"\")","v":""},null,null,null,null,null,{"$f":"IF(DataEntry!E16>0,IF(G23=\"yes\",\"\",C23),\"\")","v":1},{"$f":"IF(DataEntry!E16>0,IF(M23=\"yes\",\"\",I23),\"\")","v":-1},7,{"$f":"IF(DataEntry!E16>0,DataEntry!B16,#N/A)","v":"G"},{"$f":"IF(DataEntry!E16>0,DataEntry!C16,#N/A)","v":"2000-08-10"},{"$f":"IF(DataEntry!E16>0,DataEntry!D16,#N/A)","v":1},{"$f":"IF(DataEntry!E16>0,DataEntry!E16,#N/A)","v":5},{"$f":"IF(DataEntry!E16>0,$J$5,#N/A)","v":1.5},5.1936238496708267,-2.1936238496708271,null,null,{"$f":"IF(DataEntry!H16>0,DataEntry!B16,#N/A)","v":"G"},{"$f":"IF(DataEntry!H16>0,DataEntry!F16,#N/A)","v":"2000-02-01"},{"$f":"IF(DataEntry!H16>0,DataEntry!G16,#N/A)","v":-1},{"$f":"IF(DataEntry!H16>0,DataEntry!H16,#N/A)","v":5},{"$f":"IF(DataEntry!H16>0,$J$10,#N/A)","v":-3},3.817344825970773,-9.817344825970773,null,null,{"$f":"IF(DataEntry!E16>0,A23,\"\")","v":"G"},{"$f":"IF(DataEntry!E16>0,E23,#N/A)","v":8.0433207844859814E-2},{"$f":"IF(DataEntry!H16>0,K23,#N/A)","v":0.23656434967884327},{"$f":"IF(DataEntry!H16>0,1,#N/A)","v":1},null,{"$f":"IF(DataEntry!E16>0,A23,\"\")","v":"G"},{"$f":"IF(DataEntry!E16>0,F23,#N/A)","v":0.21739130434782608},{"$f":"IF(DataEntry!H16>0,L23,#N/A)","v":0.21739130434782608},{"$f":"IF(DataEntry!H16>0,3,#N/A)","v":3}]
[{"$f":"YoudenCalculations!I18","v":"H"},{"$f":"IF(DataEntry!E17>0,DataEntry!C17,\"\")","v":"2000-10-01"},{"$f":"YoudenCalculations!J18","v":2},{"$f":"IF(DataEntry!E17>0,DataEntry!E17,\"\")","v":9},{"$f":"IF(DataEntry!E17>0,ABS(C24-YoudenCalculations!$J$1)/SQRT(D24^2+$J$6^2),\"\")","v":5.1395616875004664E-2},{"$f":"IF(DataEntry!E17>0,D24/$B$14,\"\")","v":0.39130434782608697},{"$f":"IF(DataEntry!E17>0,IF(ABS(C24-YoudenCalculations!$J$1)>$S$2,\"yes\",\"\"),\"\")","v":""},{"$f":"IF(DataEntry!H17>0,DataEntry!F17,\"\")","v":"2000-01-15"},{"$f":"YoudenCalculations!K18","v":-3},{"$f":"IF(DataEntry!H17>0,DataEntry!H17,\"\")","v":9},{"$f":"IF(DataEntry!H17>0,ABS(I24-YoudenCalculations!$K$1)/SQRT(J24^2+$J$11^2),\"\")","v":0},{"$f":"IF(DataEntry!H17>0,J24/$B$14,\"\")","v":0.39130434782608697},{"$f":"IF(DataEntry!H17>0,IF(ABS(I24-YoudenCalculations!$K$1)>$T$2,\"yes\",\"\"),\"\")","v":""},null,null,null,null,null,{"$f":"IF(DataEntry!E17>0,IF(G24=\"yes\",\"\",C24),\"\")","v":2},{"$f":"IF(DataEntry!E17>0,IF(M24=\"yes\",\"\",I24),\"\")","v":-3},8,{"$f":"IF(DataEntry!E17>0,DataEntry!B17,#N/A)","v":"H"},{"$f":"IF(DataEntry!E17>0,DataEntry!C17,#N/A)","v":"2000-10-01"},{"$f":"IF(DataEntry!E17>0,DataEntry!D17,#N/A)","v":2},{"$f":"IF(DataEntry!E17>0,DataEntry!E17,#N/A)","v":9},{"$f":"IF(DataEntry!E17>0,$J$5,#N/A)","v":1.5},5.1936238496708267,-2.1936238496708271,null,null,{"$f":"IF(DataEntry!H17>0,DataEntry!B17,#N/A)","v":"H"},{"$f":"IF(DataEntry!H17>0,DataEntry!F17,#N/A)","v":"2000-01-15"},{"$f":"IF(DataEntry!H17>0,DataEntry!G17,#N/A)","v":-3},{"$f":"IF(DataEntry!H17>0,DataEntry!H17,#N/A)","v":9},{"$f":"IF(DataEntry!H17>0,$J$10,#N/A)","v":-3},3.817344825970773,-9.817344825970773,null,null,{"$f":"IF(DataEntry!E17>0,A24,\"\")","v":"H"},{"$f":"IF(DataEntry!E17>0,E24,#N/A)","v":5.1395616875004664E-2},{"$f":"IF(DataEntry!H17>0,K24,#N/A)","v":0},{"$f":"IF(DataEntry!H17>0,1,#N/A)","v":1},null,{"$f":"IF(DataEntry!E17>0,A24,\"\")","v":"H"},{"$f":"IF(DataEntry!E17>0,F24,#N/A)","v":0.39130434782608697},{"$f":"IF(DataEntry!H17>0,L24,#N/A)","v":0.39130434782608697},{"$f":"IF(DataEntry!H17>0,3,#N/A)","v":3}]
[{"$f":"YoudenCalculations!I19","v":""},{"$f":"IF(DataEntry!E18>0,DataEntry!C18,\"\")","v":""},{"$f":"YoudenCalculations!J19","v":""},{"$f":"IF(DataEntry!E18>0,DataEntry!E18,\"\")","v":""},{"$f":"IF(DataEntry!E18>0,ABS(C25-YoudenCalculations!$J$1)/SQRT(D25^2+$J$6^2),\"\")","v":""},{"$f":"IF(DataEntry!E18>0,D25/$B$14,\"\")","v":""},{"$f":"IF(DataEntry!E18>0,IF(ABS(C25-YoudenCalculations!$J$1)>$S$2,\"yes\",\"\"),\"\")","v":""},{"$f":"IF(DataEntry!H18>0,DataEntry!F18,\"\")","v":""},{"$f":"YoudenCalculations!K19","v":""},{"$f":"IF(DataEntry!H18>0,DataEntry!H18,\"\")","v":""},{"$f":"IF(DataEntry!H18>0,ABS(I25-YoudenCalculations!$K$1)/SQRT(J25^2+$J$11^2),\"\")","v":""},{"$f":"IF(DataEntry!H18>0,J25/$B$14,\"\")","v":""},{"$f":"IF(DataEntry!H18>0,IF(ABS(I25-YoudenCalculations!$K$1)>$T$2,\"yes\",\"\"),\"\")","v":""},null,null,null,null,null,{"$f":"IF(DataEntry!E18>0,IF(G25=\"yes\",\"\",C25),\"\")","v":""},{"$f":"IF(DataEntry!E18>0,IF(M25=\"yes\",\"\",I25),\"\")","v":""},9,{"$f":"IF(DataEntry!E18>0,DataEntry!B18,#N/A)","v":{"$error":"#N/A"}},{"$f":"IF(DataEntry!E18>0,DataEntry!C18,#N/A)","v":{"$error":"#N/A"}},{"$f":"IF(DataEntry!E18>0,DataEntry!D18,#N/A)","v":{"$error":"#N/A"}},{"$f":"IF(DataEntry!E18>0,DataEntry!E18,#N/A)","v":{"$error":"#N/A"}},{"$f":"IF(DataEntry!E18>0,$J$5,#N/A)","v":{"$error":"#N/A"}},{"$error":"#N/A"},{"$error":"#N/A"},null,null,{"$f":"IF(DataEntry!H18>0,DataEntry!B18,#N/A)","v":{"$error":"#N/A"}},{"$f":"IF(DataEntry!H18>0,DataEntry!F18,#N/A)","v":{"$error":"#N/A"}},{"$f":"IF(DataEntry!H18>0,DataEntry!G18,#N/A)","v":{"$error":"#N/A"}},{"$f":"IF(DataEntry!H18>0,DataEntry!H18,#N/A)","v":{"$error":"#N/A"}},{"$f":"IF(DataEntry!H18>0,$J$10,#N/A)","v":{"$error":"#N/A"}},{"$error":"#N/A"},{"$error":"#N/A"},null,null,{"$f":"IF(DataEntry!E18>0,A25,\"\")","v":""},{"$f":"IF(DataEntry!E18>0,E25,#N/A)","v":{"$error":"#N/A"}},{"$f":"IF(DataEntry!H18>0,K25,#N/A)","v":{"$error":"#N/A"}},{"$f":"IF(DataEntry!H18>0,1,#N/A)","v":{"$error":"#N/A"}},null,{"$f":"IF(DataEntry!E18>0,A25,\"\")","v":""},{"$f":"IF(DataEntry!E18>0,F25,#N/A)","v":{"$error":"#N/A"}},{"$f":"IF(DataEntry!H18>0,L25,#N/A)","v":{"$error":"#N/A"}},{"$f":"IF(DataEntry!H18>0,3,#N/A)","v":{"$error":"#N/A"}}]
[{"$f":"YoudenCalculations!I20","v":""},{"$f":"IF(DataEntry!E19>0,DataEntry!C19,\"\")","v":""},{"$f":"YoudenCalculations!J20","v":""},{"$f":"IF(DataEntry!E19>0,DataEntry!E19,\"\")","v":""},{"$f":"IF(DataEntry!E19>0,ABS(C26-YoudenCalculations!$J$1)/SQRT(D26^2+$J$6^2),\"\")","v":""},{"$f":"IF(DataEntry!E19>0,D26/$B$14,\"\")","v":""},{"$f":"IF(DataEntry!E19>0,IF(ABS(C26-YoudenCalculations!$J$1)>$S$2,\"yes\",\"\"),\"\")","v":""},{"$f":"IF(DataEntry!H19>0,DataEntry!F19,\"\")","v":""},{"$f":"YoudenCalculations!K20","v":""},{"$f":"IF(DataEntry!H19>0,DataEntry!H19,\"\")","v":""},{"$f":"IF(DataEntry!H19>0,ABS(I26-YoudenCalculations!$K$1)/SQRT(J26^2+$J$11^2),\"\")","v":""},{"$f":"IF(DataEntry!H19>0,J26/$B$14,\"\")","v":""},{"$f":"IF(DataEntry!H19>0,IF(ABS(I26-YoudenCalculations!$K$1)>$T$2,\"yes\",\"\"),\"\")","v":""},null,null,null,null,null,{"$f":"IF(DataEntry!E19>0,IF(G26=\"yes\",\"\",C26),\"\")","v":""},{"$f":"IF(DataEntry!E19>0,IF(M26=\"yes\",\"\",I26),\"\")","v":""},10,{"$f":"IF(DataEntry!E19>0,DataEntry!B19,#N/A)","v":{"$error":"#N/A"}},{"$f":"IF(DataEntry!E19>0,DataEntry!C19,#N/A)","v":{"$error":"#N/A"}},{"$f":"IF(DataEntry!E19>0,DataEntry!D19,#N/A)","v":{"$error":"#N/A"}},{"$f":"IF(DataEntry!E19>0,DataEntry!E19,#N/A)","v":{"$error":"#N/A"}},{"$f":"IF(DataEntry!E19>0,$J$5,#N/A)","v":{"$error":"#N/A"}},{"$error":"#N/A"},{"$error":"#N/A"},null,null,{"$f":"IF(DataEntry!H19>0,DataEntry!B19,#N/A)","v":{"$error":"#N/A"}},{"$f":"IF(DataEntry!H19>0,DataEntry!F19,#N/A)","v":{"$error":"#N/A"}},{"$f":"IF(DataEntry!H19>0,DataEntry!G19,#N/A)","v":{"$error":"#N/A"}},{"$f":"IF(DataEntry!H19>0,DataEntry!H19,#N/A)","v":{"$error":"#N/A"}},{"$f":"IF(DataEntry!H19>0,$J$10,#N/A)","v":{"$error":"#N/A"}},{"$error":"#N/A"},{"$error":"#N/A"},null,null,{"$f":"IF(DataEntry!E19>0,A26,\"\")","v":""},{"$f":"IF(DataEntry!E19>0,E26,#N/A)","v":{"$error":"#N/A"}},{"$f":"IF(DataEntry!H19>0,K26,#N/A)","v":{"$error":"#N/A"}},{"$f":"IF(DataEntry!H19>0,1,#N/A)","v":{"$error":"#N/A"}},null,{"$f":"IF(DataEntry!E19>0,A26,\"\")","v":""},{"$f":"IF(DataEntry!E19>0,F26,#N/A)","v":{"$error":"#N/A"}},{"$f":"IF(DataEntry!H19>0,L26,#N/A)","v":{"$error":"#N/A"}},{"$f":"IF(DataEntry!H19>0,3,#N/A)","v":{"$error":"#N/A"}}]
[{"$f":"YoudenCalculations!I21","v":""},{"$f":"IF(DataEntry!E20>0,DataEntry!C20,\"\")","v":""},{"$f":"YoudenCalculations!J21","v":""},{"$f":"IF(DataEntry!E20>0,DataEntry!E20,\"\")","v":""},{"$f":"IF(DataEntry!E20>0,ABS(C27-YoudenCalculations!$J$1)/SQRT(D27^2+$J$6^2),\"\")","v":""},{"$f":"IF(DataEntry!E20>0,D27/$B$14,\"\")","v":""},{"$f":"IF(DataEntry!E20>0,IF(ABS(C27-YoudenCalculations!$J$1)>$S$2,\"yes\",\"\"),\"\")","v":""},{"$f":"IF(DataEntry!H20>0,DataEntry!F20,\"\")","v":""},{"$f":"YoudenCalculations!K21","v":""},{"$f":"IF(DataEntry!H20>0,DataEntry!H20,\"\")","v":""},{"$f":"IF(DataEntry!H20>0,ABS(I27-YoudenCalculations!$K$1)/SQRT(J27^2+$J$11^2),\"\")","v":""},{"$f":"IF(DataEntry!H20>0,J27/$B$14,\"\")","v":""},{"$f":"IF(DataEntry!H20>0,IF(ABS(I27-YoudenCalculations!$K$1)>$T$2,\"yes\",\"\"),\"\")","v":""},null,null,null,null,null,{"$f":"IF(DataEntry!E20>0,IF(G27=\"yes\",\"\",C27),\"\")","v":""},{"$f":"IF(DataEntry!E20>0,IF(M27=\"yes\",\"\",I27),\"\")","v":""},11,{"$f":"IF(DataEntry!E20>0,DataEntry!B20,#N/A)","v":{"$error":"#N/A"}},{"$f":"IF(DataEntry!E20>0,DataEntry!C20,#N/A)","v":{"$error":"#N/A"}},{"$f":"IF(DataEntry!E20>0,DataEntry!D20,#N/A)","v":{"$error":"#N/A"}},{"$f":"IF(DataEntry!E20>0,DataEntry!E20,#N/A)","v":{"$error":"#N/A"}},{"$f":"IF(DataEntry!E20>0,$J$5,#N/A)","v":{"$error":"#N/A"}},{"$error":"#N/A"},{"$error":"#N/A"},null,null,{"$f":"IF(DataEntry!H20>0,DataEntry!B20,#N/A)","v":{"$error":"#N/A"}},{"$f":"IF(DataEntry!H20>0,DataEntry!F20,#N/A)","v":{"$error":"#N/A"}},{"$f":"IF(DataEntry!H20>0,DataEntry!G20,#N/A)","v":{"$error":"#N/A"}},{"$f":"IF(DataEntry!H20>0,DataEntry!H20,#N/A)","v":{"$error":"#N/A"}},{"$f":"IF(DataEntry!H20>0,$J$10,#N/A)","v":{"$error":"#N/A"}},{"$error":"#N/A"},{"$error":"#N/A"},null,null,{"$f":"IF(DataEntry!E20>0,A27,\"\")","v":""},{"$f":"IF(DataEntry!E20>0,E27,#N/A)","v":{"$error":"#N/A"}},{"$f":"IF(DataEntry!H20>0,K27,#N/A)","v":{"$error":"#N/A"}},{"$f":"IF(DataEntry!H20>0,1,#N/A)","v":{"$error":"#N/A"}},null,{"$f":"IF(DataEntry!E20>0,A27,\"\")","v":""},{"$f":"IF(DataEntry!E20>0,F27,#N/A)","v":{"$error":"#N/A"}},{"$f":"IF(DataEntry!H20>0,L27,#N/A)","v":{"$error":"#N/A"}},{"$f":"IF(DataEntry!H20>0,3,#N/A)","v":{"$error":"#N/A"}}]
[{"$f":"YoudenCalculations!I22","v":""},{"$f":"IF(DataEntry!E21>0,DataEntry!C21,\"\")","v":""},{"$f":"YoudenCalculations!J22","v":""},{"$f":"IF(DataEntry!E21>0,DataEntry!E21,\"\")","v":""},{"$f":"IF(DataEntry!E21>0,ABS(C28-YoudenCalculations!$J$1)/SQRT(D28^2+$J$6^2),\"\")","v":""},{"$f":"IF(DataEntry!E21>0,D28/$B$14,\"\")","v":""},{"$f":"IF(DataEntry!E21>0,IF(ABS(C28-YoudenCalculations!$J$1)>$S$2,\"yes\",\"\"),\"\")","v":""},{"$f":"IF(DataEntry!H21>0,DataEntry!F21,\"\")","v":""},{"$f":"YoudenCalculations!K22","v":""},{"$f":"IF(DataEntry!H21>0,DataEntry!H21,\"\")","v":""},{"$f":"IF(DataEntry!H21>0,ABS(I28-YoudenCalculations!$K$1)/SQRT(J28^2+$J$11^2),\"\")","v":""},{"$f":"IF(DataEntry!H21>0,J28/$B$14,\"\")","v":""},{"$f":"IF(DataEntry!H21>0,IF(ABS(I28-YoudenCalculations!$K$1)>$T$2,\"yes\",\"\"),\"\")","v":""},null,null,null,null,null,{"$f":"IF(DataEntry!E21>0,IF(G28=\"yes\",\"\",C28),\"\")","v":""},{"$f":"IF(DataEntry!E21>0,IF(M28=\"yes\",\"\",I28),\"\")","v":""},12,{"$f":"IF(DataEntry!E21>0,DataEntry!B21,#N/A)","v":{"$error":"#N/A"}},{"$f":"IF(DataEntry!E21>0,DataEntry!C21,#N/A)","v":{"$error":"#N/A"}},{"$f":"IF(DataEntry!E21>0,DataEntry!D21,#N/A)","v":{"$error":"#N/A"}},{"$f":"IF(DataEntry!E21>0,DataEntry!E21,#N/A)","v":{"$error":"#N/A"}},{"$f":"IF(DataEntry!E21>0,$J$5,#N/A)","v":{"$error":"#N/A"}},{"$error":"#N/A"},{"$error":"#N/A"},null,null,{"$f":"IF(DataEntry!H21>0,DataEntry!B21,#N/A)","v":{"$error":"#N/A"}},{"$f":"IF(DataEntry!H21>0,DataEntry!F21,#N/A)","v":{"$error":"#N/A"}},{"$f":"IF(DataEntry!H21>0,DataEntry!G21,#N/A)","v":{"$error":"#N/A"}},{"$f":"IF(DataEntry!H21>0,DataEntry!H21,#N/A)","v":{"$error":"#N/A"}},{"$f":"IF(DataEntry!H21>0,$J$10,#N/A)","v":{"$error":"#N/A"}},{"$error":"#N/A"},{"$error":"#N/A"},null,null,{"$f":"IF(DataEntry!E21>0,A28,\"\")","v":""},{"$f":"IF(DataEntry!E21>0,E28,#N/A)","v":{"$error":"#N/A"}},{"$f":"IF(DataEntry!H21>0,K28,#N/A)","v":{"$error":"#N/A"}},{"$f":"IF(DataEntry!H21>0,1,#N/A)","v":{"$error":"#N/A"}},null,{"$f":"IF(DataEntry!E21>0,A28,\"\")","v":""},{"$f":"IF(DataEntry!E21>0,F28,#N/A)","v":{"$error":"#N/A"}},{"$f":"IF(DataEntry!H21>0,L28,#N/A)","v":{"$error":"#N/A"}},{"$f":"IF(DataEntry!H21>0,3,#N/A)","v":{"$error":"#N/A"}}]
[{"$f":"YoudenCalculations!I23","v":""},{"$f":"IF(DataEntry!E22>0,DataEntry!C22,\"\")","v":""},{"$f":"YoudenCalculations!J23","v":""},{"$f":"IF(DataEntry!E22>0,DataEntry!E22,\"\")","v":""},{"$f":"IF(DataEntry!E22>0,ABS(C29-YoudenCalculations!$J$1)/SQRT(D29^2+$J$6^2),\"\")","v":""},{"$f":"IF(DataEntry!E22>0,D29/$B$14,\"\")","v":""},{"$f":"IF(DataEntry!E22>0,IF(ABS(C29-YoudenCalculations!$J$1)>$S$2,\"yes\",\"\"),\"\")","v":""},{"$f":"IF(DataEntry!H22>0,DataEntry!F22,\"\")","v":""},{"$f":"YoudenCalculations!K23","v":""},{"$f":"IF(DataEntry!H22>0,DataEntry!H22,\"\")","v":""},{"$f":"IF(DataEntry!H22>0,ABS(I29-YoudenCalculations!$K$1)/SQRT(J29^2+$J$11^2),\"\")","v":""},{"$f":"IF(DataEntry!H22>0,J29/$B$14,\"\")","v":""},{"$f":"IF(DataEntry!H22>0,IF(ABS(I29-YoudenCalculations!$K$1)>$T$2,\"yes\",\"\"),\"\")","v":""},null,null,null,null,null,{"$f":"IF(DataEntry!E22>0,IF(G29=\"yes\",\"\",C29),\"\")","v":""},{"$f":"IF(DataEntry!E22>0,IF(M29=\"yes\",\"\",I29),\"\")","v":""},13,{"$f":"IF(DataEntry!E22>0,DataEntry!B22,#N/A)","v":{"$error":"#N/A"}},{"$f":"IF(DataEntry!E22>0,DataEntry!C22,#N/A)","v":{"$error":"#N/A"}},{"$f":"IF(DataEntry!E22>0,DataEntry!D22,#N/A)","v":{"$error":"#N/A"}},{"$f":"IF(DataEntry!E22>0,DataEntry!E22,#N/A)","v":{"$error":"#N/A"}},{"$f":"IF(DataEntry!E22>0,$J$5,#N/A)","v":{"$error":"#N/A"}},{"$error":"#N/A"},{"$error":"#N/A"},null,null,{"$f":"IF(DataEntry!H22>0,DataEntry!B22,#N/A)","v":{"$error":"#N/A"}},{"$f":"IF(DataEntry!H22>0,DataEntry!F22,#N/A)","v":{"$error":"#N/A"}},{"$f":"IF(DataEntry!H22>0,DataEntry!G22,#N/A)","v":{"$error":"#N/A"}},{"$f":"IF(DataEntry!H22>0,DataEntry!H22,#N/A)","v":{"$error":"#N/A"}},{"$f":"IF(DataEntry!H22>0,$J$10,#N/A)","v":{"$error":"#N/A"}},{"$error":"#N/A"},{"$error":"#N/A"},null,null,{"$f":"IF(DataEntry!E22>0,A29,\"\")","v":""},{"$f":"IF(DataEntry!E22>0,E29,#N/A)","v":{"$error":"#N/A"}},{"$f":"IF(DataEntry!H22>0,K29,#N/A)","v":{"$error":"#N/A"}},{"$f":"IF(DataEntry!H22>0,1,#N/A)","v":{"$error":"#N/A"}},null,{"$f":"IF(DataEntry!E22>0,A29,\"\")","v":""},{"$f":"IF(DataEntry!E22>0,F29,#N/A)","v":{"$error":"#N/A"}},{"$f":"IF(DataEntry!H22>0,L29,#N/A)","v":{"$error":"#N/A"}},{"$f":"IF(DataEntry!H22>0,3,#N/A)","v":{"$error":"#N/A"}}]
[{"$f":"YoudenCalculations!I24","v":""},{"$f":"IF(DataEntry!E23>0,DataEntry!C23,\"\")","v":""},{"$f":"YoudenCalculations!J24","v":""},{"$f":"IF(DataEntry!E23>0,DataEntry!E23,\"\")","v":""},{"$f":"IF(DataEntry!E23>0,ABS(C30-YoudenCalculations!$J$1)/SQRT(D30^2+$J$6^2),\"\")","v":""},{"$f":"IF(DataEntry!E23>0,D30/$B$14,\"\")","v":""},{"$f":"IF(DataEntry!E23>0,IF(ABS(C30-YoudenCalculations!$J$1)>$S$2,\"yes\",\"\"),\"\")","v":""},{"$f":"IF(DataEntry!H23>0,DataEntry!F23,\"\")","v":""},{"$f":"YoudenCalculations!K24","v":""},{"$f":"IF(DataEntry!H23>0,DataEntry!H23,\"\")","v":""},{"$f":"IF(DataEntry!H23>0,ABS(I30-YoudenCalculations!$K$1)/SQRT(J30^2+$J$11^2),\"\")","v":""},{"$f":"IF(DataEntry!H23>0,J30/$B$14,\"\")","v":""},{"$f":"IF(DataEntry!H23>0,IF(ABS(I30-YoudenCalculations!$K$1)>$T$2,\"yes\",\"\"),\"\")","v":""},null,null,null,null,null,{"$f":"IF(DataEntry!E23>0,IF(G30=\"yes\",\"\",C30),\"\")","v":""},{"$f":"IF(DataEntry!E23>0,IF(M30=\"yes\",\"\",I30),\"\")","v":""},14,{"$f":"IF(DataEntry!E23>0,DataEntry!B23,#N/A)","v":{"$error":"#N/A"}},{"$f":"IF(DataEntry!E23>0,DataEntry!C23,#N/A)","v":{"$error":"#N/A"}},{"$f":"IF(DataEntry!E23>0,DataEntry!D23,#N/A)","v":{"$error":"#N/A"}},{"$f":"IF(DataEntry!E23>0,DataEntry!E23,#N/A)","v":{"$error":"#N/A"}},{"$f":"IF(DataEntry!E23>0,$J$5,#N/A)","v":{"$error":"#N/A"}},{"$error":"#N/A"},{"$error":"#N/A"},null,null,{"$f":"IF(DataEntry!H23>0,DataEntry!B23,#N/A)","v":{"$error":"#N/A"}},{"$f":"IF(DataEntry!H23>0,DataEntry!F23,#N/A)","v":{"$error":"#N/A"}},{"$f":"IF(DataEntry!H23>0,DataEntry!G23,#N/A)","v":{"$error":"#N/A"}},{"$f":"IF(DataEntry!H23>0,DataEntry!H23,#N/A)","v":{"$error":"#N/A"}},{"$f":"IF(DataEntry!H23>0,$J$10,#N/A)","v":{"$error":"#N/A"}},{"$error":"#N/A"},{"$error":"#N/A"},null,null,{"$f":"IF(DataEntry!E23>0,A30,\"\")","v":""},{"$f":"IF(DataEntry!E23>0,E30,#N/A)","v":{"$error":"#N/A"}},{"$f":"IF(DataEntry!H23>0,K30,#N/A)","v":{"$error":"#N/A"}},{"$f":"IF(DataEntry!H23>0,1,#N/A)","v":{"$error":"#N/A"}},null,{"$f":"IF(DataEntry!E23>0,A30,\"\")","v":""},{"$f":"IF(DataEntry!E23>0,F30,#N/A)","v":{"$error":"#N/A"}},{"$f":"IF(DataEntry!H23>0,L30,#N/A)","v":{"$error":"#N/A"}},{"$f":"IF(DataEntry!H23>0,3,#N/A)","v":{"$error":"#N/A"}}]
[{"$f":"YoudenCalculations!I25","v":""},{"$f":"IF(DataEntry!E24>0,DataEntry!C24,\"\")","v":""},{"$f":"YoudenCalculations!J25","v":""},{"$f":"IF(DataEntry!E24>0,DataEntry!E24,\"\")","v":""},{"$f":"IF(DataEntry!E24>0,ABS(C31-YoudenCalculations!$J$1)/SQRT(D31^2+$J$6^2),\"\")","v":""},{"$f":"IF(DataEntry!E24>0,D31/$B$14,\"\")","v":""},{"$f":"IF(DataEntry!E24>0,IF(ABS(C31-YoudenCalculations!$J$1)>$S$2,\"yes\",\"\"),\"\")","v":""},{"$f":"IF(DataEntry!H24>0,DataEntry!F24,\"\")","v":""},{"$f":"YoudenCalculations!K25","v":""},{"$f":"IF(DataEntry!H24>0,DataEntry!H24,\"\")","v":""},{"$f":"IF(DataEntry!H24>0,ABS(I31-YoudenCalculations!$K$1)/SQRT(J31^2+$J$11^2),\"\")","v":""},{"$f":"IF(DataEntry!H24>0,J31/$B$14,\"\")","v":""},{"$f":"IF(DataEntry!H24>0,IF(ABS(I31-YoudenCalculations!$K$1)>$T$2,\"yes\",\"\"),\"\")","v":""},null,null,null,null,null,{"$f":"IF(DataEntry!E24>0,IF(G31=\"yes\",\"\",C31),\"\")","v":""},{"$f":"IF(DataEntry!E24>0,IF(M31=\"yes\",\"\",I31),\"\")","v":""},15,{"$f":"IF(DataEntry!E24>0,DataEntry!B24,#N/A)","v":{"$error":"#N/A"}},{"$f":"IF(DataEntry!E24>0,DataEntry!C24,#N/A)","v":{"$error":"#N/A"}},{"$f":"IF(DataEntry!E24>0,DataEntry!D24,#N/A)","v":{"$error":"#N/A"}},{"$f":"IF(DataEntry!E24>0,DataEntry!E24,#N/A)","v":{"$error":"#N/A"}},{"$f":"IF(DataEntry!E24>0,$J$5,#N/A)","v":{"$error":"#N/A"}},{"$error":"#N/A"},{"$error":"#N/A"},null,null,{"$f":"IF(DataEntry!H24>0,DataEntry!B24,#N/A)","v":{"$error":"#N/A"}},{"$f":"IF(DataEntry!H24>0,DataEntry!F24,#N/A)","v":{"$error":"#N/A"}},{"$f":"IF(DataEntry!H24>0,DataEntry!G24,#N/A)","v":{"$error":"#N/A"}},{"$f":"IF(DataEntry!H24>0,DataEntry!H24,#N/A)","v":{"$error":"#N/A"}},{"$f":"IF(DataEntry!H24>0,$J$10,#N/A)","v":{"$error":"#N/A"}},{"$error":"#N/A"},{"$error":"#N/A"},null,null,{"$f":"IF(DataEntry!E24>0,A31,\"\")","v":""},{"$f":"IF(DataEntry!E24>0,E31,#N/A)","v":{"$error":"#N/A"}},{"$f":"IF(DataEntry!H24>0,K31,#N/A)","v":{"$error":"#N/A"}},{"$f":"IF(DataEntry!H24>0,1,#N/A)","v":{"$error":"#N/A"}},null,{"$f":"IF(DataEntry!E24>0,A31,\"\")","v":""},{"$f":"IF(DataEntry!E24>0,F31,#N/A)","v":{"$error":"#N/A"}},{"$f":"IF(DataEntry!H24>0,L31,#N/A)","v":{"$error":"#N/A"}},{"$f":"IF(DataEntry!H24>0,3,#N/A)","v":{"$error":"#N/A"}}]
[{"$f":"YoudenCalculations!I26","v":""},{"$f":"IF(DataEntry!E25>0,DataEntry!C25,\"\")","v":""},{"$f":"YoudenCalculations!J26","v":""},{"$f":"IF(DataEntry!E25>0,DataEntry!E25,\"\")","v":""},{"$f":"IF(DataEntry!E25>0,ABS(C32-YoudenCalculations!$J$1)/SQRT(D32^2+$J$6^2),\"\")","v":""},{"$f":"IF(DataEntry!E25>0,D32/$B$14,\"\")","v":""},{"$f":"IF(DataEntry!E25>0,IF(ABS(C32-YoudenCalculations!$J$1)>$S$2,\"yes\",\"\"),\"\")","v":""},{"$f":"IF(DataEntry!H25>0,DataEntry!F25,\"\")","v":""},{"$f":"YoudenCalculations!K26","v":""},{"$f":"IF(DataEntry!H25>0,DataEntry!H25,\"\")","v":""},{"$f":"IF(DataEntry!H25>0,ABS(I32-YoudenCalculations!$K$1)/SQRT(J32^2+$J$11^2),\"\")","v":""},{"$f":"IF(DataEntry!H25>0,J32/$B$14,\"\")","v":""},{"$f":"IF(DataEntry!H25>0,IF(ABS(I32-YoudenCalculations!$K$1)>$T$2,\"yes\",\"\"),\"\")","v":""},null,null,null,null,null,{"$f":"IF(DataEntry!E25>0,IF(G32=\"yes\",\"\",C32),\"\")","v":""},{"$f":"IF(DataEntry!E25>0,IF(M32=\"yes\",\"\",I32),\"\")","v":""},16,{"$f":"IF(DataEntry!E25>0,DataEntry!B25,#N/A)","v":{"$error":"#N/A"}},{"$f":"IF(DataEntry!E25>0,DataEntry!C25,#N/A)","v":{"$error":"#N/A"}},{"$f":"IF(DataEntry!E25>0,DataEntry!D25,#N/A)","v":{"$error":"#N/A"}},{"$f":"IF(DataEntry!E25>0,DataEntry!E25,#N/A)","v":{"$error":"#N/A"}},{"$f":"IF(DataEntry!E25>0,$J$5,#N/A)","v":{"$error":"#N/A"}},{"$error":"#N/A"},{"$error":"#N/A"},null,null,{"$f":"IF(DataEntry!H25>0,DataEntry!B25,#N/A)","v":{"$error":"#N/A"}},{"$f":"IF(DataEntry!H25>0,DataEntry!F25,#N/A)","v":{"$error":"#N/A"}},{"$f":"IF(DataEntry!H25>0,DataEntry!G25,#N/A)","v":{"$error":"#N/A"}},{"$f":"IF(DataEntry!H25>0,DataEntry!H25,#N/A)","v":{"$error":"#N/A"}},{"$f":"IF(DataEntry!H25>0,$J$10,#N/A)","v":{"$error":"#N/A"}},{"$error":"#N/A"},{"$error":"#N/A"},null,null,{"$f":"IF(DataEntry!E25>0,A32,\"\")","v":""},{"$f":"IF(DataEntry!E25>0,E32,#N/A)","v":{"$error":"#N/A"}},{"$f":"IF(DataEntry!H25>0,K32,#N/A)","v":{"$error":"#N/A"}},{"$f":"IF(DataEntry!H25>0,1,#N/A)","v":{"$error":"#N/A"}},null,{"$f":"IF(DataEntry!E25>0,A32,\"\")","v":""},{"$f":"IF(DataEntry!E25>0,F32,#N/A)","v":{"$error":"#N/A"}},{"$f":"IF(DataEntry!H25>0,L32,#N/A)","v":{"$error":"#N/A"}},{"$f":"IF(DataEntry!H25>0,3,#N/A)","v":{"$error":"#N/A"}}]
[{"$f":"YoudenCalculations!I27","v":""},{"$f":"IF(DataEntry!E26>0,DataEntry!C26,\"\")","v":""},{"$f":"YoudenCalculations!J27","v":""},{"$f":"IF(DataEntry!E26>0,DataEntry!E26,\"\")","v":""},{"$f":"IF(DataEntry!E26>0,ABS(C33-YoudenCalculations!$J$1)/SQRT(D33^2+$J$6^2),\"\")","v":""},{"$f":"IF(DataEntry!E26>0,D33/$B$14,\"\")","v":""},{"$f":"IF(DataEntry!E26>0,IF(ABS(C33-YoudenCalculations!$J$1)>$S$2,\"yes\",\"\"),\"\")","v":""},{"$f":"IF(DataEntry!H26>0,DataEntry!F26,\"\")","v":""},{"$f":"YoudenCalculations!K27","v":""},{"$f":"IF(DataEntry!H26>0,DataEntry!H26,\"\")","v":""},{"$f":"IF(DataEntry!H26>0,ABS(I33-YoudenCalculations!$K$1)/SQRT(J33^2+$J$11^2),\"\")","v":""},{"$f":"IF(DataEntry!H26>0,J33/$B$14,\"\")","v":""},{"$f":"IF(DataEntry!H26>0,IF(ABS(I33-YoudenCalculations!$K$1)>$T$2,\"yes\",\"\"),\"\")","v":""},null,null,null,null,null,{"$f":"IF(DataEntry!E26>0,IF(G33=\"yes\",\"\",C33),\"\")","v":""},{"$f":"IF(DataEntry!E26>0,IF(M33=\"yes\",\"\",I33),\"\")","v":""},17,{"$f":"IF(DataEntry!E26>0,DataEntry!B26,#N/A)","v":{"$error":"#N/A"}},{"$f":"IF(DataEntry!E26>0,DataEntry!C26,#N/A)","v":{"$error":"#N/A"}},{"$f":"IF(DataEntry!E26>0,DataEntry!D26,#N/A)","v":{"$error":"#N/A"}},{"$f":"IF(DataEntry!E26>0,DataEntry!E26,#N/A)","v":{"$error":"#N/A"}},{"$f":"IF(DataEntry!E26>0,$J$5,#N/A)","v":{"$error":"#N/A"}},{"$error":"#N/A"},{"$error":"#N/A"},null,null,{"$f":"IF(DataEntry!H26>0,DataEntry!B26,#N/A)","v":{"$error":"#N/A"}},{"$f":"IF(DataEntry!H26>0,DataEntry!F26,#N/A)","v":{"$error":"#N/A"}},{"$f":"IF(DataEntry!H26>0,DataEntry!G26,#N/A)","v":{"$error":"#N/A"}},{"$f":"IF(DataEntry!H26>0,DataEntry!H26,#N/A)","v":{"$error":"#N/A"}},{"$f":"IF(DataEntry!H26>0,$J$10,#N/A)","v":{"$error":"#N/A"}},{"$error":"#N/A"},{"$error":"#N/A"},null,null,{"$f":"IF(DataEntry!E26>0,A33,\"\")","v":""},{"$f":"IF(DataEntry!E26>0,E33,#N/A)","v":{"$error":"#N/A"}},{"$f":"IF(DataEntry!H26>0,K33,#N/A)","v":{"$error":"#N/A"}},{"$f":"IF(DataEntry!H26>0,1,#N/A)","v":{"$error":"#N/A"}},null,{"$f":"IF(DataEntry!E26>0,A33,\"\")","v":""},{"$f":"IF(DataEntry!E26>0,F33,#N/A)","v":{"$error":"#N/A"}},{"$f":"IF(DataEntry!H26>0,L33,#N/A)","v":{"$error":"#N/A"}},{"$f":"IF(DataEntry!H26>0,3,#N/A)","v":{"$error":"#N/A"}}]
[{"$f":"YoudenCalculations!I28","v":""},{"$f":"IF(DataEntry!E27>0,DataEntry!C27,\"\")","v":""},{"$f":"YoudenCalculations!J28","v":""},{"$f":"IF(DataEntry!E27>0,DataEntry!E27,\"\")","v":""},{"$f":"IF(DataEntry!E27>0,ABS(C34-YoudenCalculations!$J$1)/SQRT(D34^2+$J$6^2),\"\")","v":""},{"$f":"IF(DataEntry!E27>0,D34/$B$14,\"\")","v":""},{"$f":"IF(DataEntry!E27>0,IF(ABS(C34-YoudenCalculations!$J$1)>$S$2,\"yes\",\"\"),\"\")","v":""},{"$f":"IF(DataEntry!H27>0,DataEntry!F27,\"\")","v":""},{"$f":"YoudenCalculations!K28","v":""},{"$f":"IF(DataEntry!H27>0,DataEntry!H27,\"\")","v":""},{"$f":"IF(DataEntry!H27>0,ABS(I34-YoudenCalculations!$K$1)/SQRT(J34^2+$J$11^2),\"\")","v":""},{"$f":"IF(DataEntry!H27>0,J34/$B$14,\"\")","v":""},{"$f":"IF(DataEntry!H27>0,IF(ABS(I34-YoudenCalculations!$K$1)>$T$2,\"yes\",\"\"),\"\")","v":""},null,null,null,null,null,{"$f":"IF(DataEntry!E27>0,IF(G34=\"yes\",\"\",C34),\"\")","v":""},{"$f":"IF(DataEntry!E27>0,IF(M34=\"yes\",\"\",I34),\"\")","v":""},18,{"$f":"IF(DataEntry!E27>0,DataEntry!B27,#N/A)","v":{"$error":"#N/A"}},{"$f":"IF(DataEntry!E27>0,DataEntry!C27,#N/A)","v":{"$error":"#N/A"}},{"$f":"IF(DataEntry!E27>0,DataEntry!D27,#N/A)","v":{"$error":"#N/A"}},{"$f":"IF(DataEntry!E27>0,DataEntry!E27,#N/A)","v":{"$error":"#N/A"}},{"$f":"IF(DataEntry!E27>0,$J$5,#N/A)","v":{"$error":"#N/A"}},{"$error":"#N/A"},{"$error":"#N/A"},null,null,{"$f":"IF(DataEntry!H27>0,DataEntry!B27,#N/A)","v":{"$error":"#N/A"}},{"$f":"IF(DataEntry!H27>0,DataEntry!F27,#N/A)","v":{"$error":"#N/A"}},{"$f":"IF(DataEntry!H27>0,DataEntry!G27,#N/A)","v":{"$error":"#N/A"}},{"$f":"IF(DataEntry!H27>0,DataEntry!H27,#N/A)","v":{"$error":"#N/A"}},{"$f":"IF(DataEntry!H27>0,$J$10,#N/A)","v":{"$error":"#N/A"}},{"$error":"#N/A"},{"$error":"#N/A"},null,null,{"$f":"IF(DataEntry!E27>0,A34,\"\")","v":""},{"$f":"IF(DataEntry!E27>0,E34,#N/A)","v":{"$error":"#N/A"}},{"$f":"IF(DataEntry!H27>0,K34,#N/A)","v":{"$error":"#N/A"}},{"$f":"IF(DataEntry!H27>0,1,#N/A)","v":{"$error":"#N/A"}},null,{"$f":"IF(DataEntry!E27>0,A34,\"\")","v":""},{"$f":"IF(DataEntry!E27>0,F34,#N/A)","v":{"$error":"#N/A"}},{"$f":"IF(DataEntry!H27>0,L34,#N/A)","v":{"$error":"#N/A"}},{"$f":"IF(DataEntry!H27>0,3,#N/A)","v":{"$error":"#N/A"}}]
[{"$f":"YoudenCalculations!I29","v":""},{"$f":"IF(DataEntry!E28>0,DataEntry!C28,\"\")","v":""},{"$f":"YoudenCalculations!J29","v":""},{"$f":"IF(DataEntry!E28>0,DataEntry!E28,\"\")","v":""},{"$f":"IF(DataEntry!E28>0,ABS(C35-YoudenCalculations!$J$1)/SQRT(D35^2+$J$6^2),\"\")","v":""},{"$f":"IF(DataEntry!E28>0,D35/$B$14,\"\")","v":""},{"$f":"IF(DataEntry!E28>0,IF(ABS(C35-YoudenCalculations!$J$1)>$S$2,\"yes\",\"\"),\"\")","v":""},{"$f":"IF(DataEntry!H28>0,DataEntry!F28,\"\")","v":""},{"$f":"YoudenCalculations!K29","v":""},{"$f":"IF(DataEntry!H28>0,DataEntry!H28,\"\")","v":""},{"$f":"IF(DataEntry!H28>0,ABS(I35-YoudenCalculations!$K$1)/SQRT(J35^2+$J$11^2),\"\")","v":""},{"$f":"IF(DataEntry!H28>0,J35/$B$14,\"\")","v":""},{"$f":"IF(DataEntry!H28>0,IF(ABS(I35-YoudenCalculations!$K$1)>$T$2,\"yes\",\"\"),\"\")","v":""},null,null,null,null,null,{"$f":"IF(DataEntry!E28>0,IF(G35=\"yes\",\"\",C35),\"\")","v":""},{"$f":"IF(DataEntry!E28>0,IF(M35=\"yes\",\"\",I35),\"\")","v":""},19,{"$f":"IF(DataEntry!E28>0,DataEntry!B28,#N/A)","v":{"$error":"#N/A"}},{"$f":"IF(DataEntry!E28>0,DataEntry!C28,#N/A)","v":{"$error":"#N/A"}},{"$f":"IF(DataEntry!E28>0,DataEntry!D28,#N/A)","v":{"$error":"#N/A"}},{"$f":"IF(DataEntry!E28>0,DataEntry!E28,#N/A)","v":{"$error":"#N/A"}},{"$f":"IF(DataEntry!E28>0,$J$5,#N/A)","v":{"$error":"#N/A"}},{"$error":"#N/A"},{"$error":"#N/A"},null,null,{"$f":"IF(DataEntry!H28>0,DataEntry!B28,#N/A)","v":{"$error":"#N/A"}},{"$f":"IF(DataEntry!H28>0,DataEntry!F28,#N/A)","v":{"$error":"#N/A"}},{"$f":"IF(DataEntry!H28>0,DataEntry!G28,#N/A)","v":{"$error":"#N/A"}},{"$f":"IF(DataEntry!H28>0,DataEntry!H28,#N/A)","v":{"$error":"#N/A"}},{"$f":"IF(DataEntry!H28>0,$J$10,#N/A)","v":{"$error":"#N/A"}},{"$error":"#N/A"},{"$error":"#N/A"},null,null,{"$f":"IF(DataEntry!E28>0,A35,\"\")","v":""},{"$f":"IF(DataEntry!E28>0,E35,#N/A)","v":{"$error":"#N/A"}},{"$f":"IF(DataEntry!H28>0,K35,#N/A)","v":{"$error":"#N/A"}},{"$f":"IF(DataEntry!H28>0,1,#N/A)","v":{"$error":"#N/A"}},null,{"$f":"IF(DataEntry!E28>0,A35,\"\")","v":""},{"$f":"IF(DataEntry!E28>0,F35,#N/A)","v":{"$error":"#N/A"}},{"$f":"IF(DataEntry!H28>0,L35,#N/A)","v":{"$error":"#N/A"}},{"$f":"IF(DataEntry!H28>0,3,#N/A)","v":{"$error":"#N/A"}}]
[{"$f":"YoudenCalculations!I30","v":""},{"$f":"IF(DataEntry!E29>0,DataEntry!C29,\"\")","v":""},{"$f":"YoudenCalculations!J30","v":""},{"$f":"IF(DataEntry!E29>0,DataEntry!E29,\"\")","v":""},{"$f":"IF(DataEntry!E29>0,ABS(C36-YoudenCalculations!$J$1)/SQRT(D36^2+$J$6^2),\"\")","v":""},{"$f":"IF(DataEntry!E29>0,D36/$B$14,\"\")","v":""},{"$f":"IF(DataEntry!E29>0,IF(ABS(C36-YoudenCalculations!$J$1)>$S$2,\"yes\",\"\"),\"\")","v":""},{"$f":"IF(DataEntry!H29>0,DataEntry!F29,\"\")","v":""},{"$f":"YoudenCalculations!K30","v":""},{"$f":"IF(DataEntry!H29>0,DataEntry!H29,\"\")","v":""},{"$f":"IF(DataEntry!H29>0,ABS(I36-YoudenCalculations!$K$1)/SQRT(J36^2+$J$11^2),\"\")","v":""},{"$f":"IF(DataEntry!H29>0,J36/$B$14,\"\")","v":""},{"$f":"IF(DataEntry!H29>0,IF(ABS(I36-YoudenCalculations!$K$1)>$T$2,\"yes\",\"\"),\"\")","v":""},null,null,null,null,null,{"$f":"IF(DataEntry!E29>0,IF(G36=\"yes\",\"\",C36),\"\")","v":""},{"$f":"IF(DataEntry!E29>0,IF(M36=\"yes\",\"\",I36),\"\")","v":""},20,{"$f":"IF(DataEntry!E29>0,DataEntry!B29,#N/A)","v":{"$error":"#N/A"}},{"$f":"IF(DataEntry!E29>0,DataEntry!C29,#N/A)","v":{"$error":"#N/A"}},{"$f":"IF(DataEntry!E29>0,DataEntry!D29,#N/A)","v":{"$error":"#N/A"}},{"$f":"IF(DataEntry!E29>0,DataEntry!E29,#N/A)","v":{"$error":"#N/A"}},{"$f":"IF(DataEntry!E29>0,$J$5,#N/A)","v":{"$error":"#N/A"}},{"$error":"#N/A"},{"$error":"#N/A"},null,null,{"$f":"IF(DataEntry!H29>0,DataEntry!B29,#N/A)","v":{"$error":"#N/A"}},{"$f":"IF(DataEntry!H29>0,DataEntry!F29,#N/A)","v":{"$error":"#N/A"}},{"$f":"IF(DataEntry!H29>0,DataEntry!G29,#N/A)","v":{"$error":"#N/A"}},{"$f":"IF(DataEntry!H29>0,DataEntry!H29,#N/A)","v":{"$error":"#N/A"}},{"$f":"IF(DataEntry!H29>0,$J$10,#N/A)","v":{"$error":"#N/A"}},{"$error":"#N/A"},{"$error":"#N/A"},null,null,{"$f":"IF(DataEntry!E29>0,A36,\"\")","v":""},{"$f":"IF(DataEntry!E29>0,E36,#N/A)","v":{"$error":"#N/A"}},{"$f":"IF(DataEntry!H29>0,K36,#N/A)","v":{"$error":"#N/A"}},{"$f":"IF(DataEntry!H29>0,1,#N/A)","v":{"$error":"#N/A"}},null,{"$f":"IF(DataEntry!E29>0,A36,\"\")","v":""},{"$f":"IF(DataEntry!E29>0,F36,#N/A)","v":{"$error":"#N/A"}},{"$f":"IF(DataEntry!H29>0,L36,#N/A)","v":{"$error":"#N/A"}},{"$f":"IF(DataEntry!H29>0,3,#N/A)","v":{"$error":"#N/A"}}]
[{"$f":"YoudenCalculations!I31","v":""},{"$f":"IF(DataEntry!E30>0,DataEntry!C30,\"\")","v":""},{"$f":"YoudenCalculations!J31","v":""},{"$f":"IF(DataEntry!E30>0,DataEntry!E30,\"\")","v":""},{"$f":"IF(DataEntry!E30>0,ABS(C37-YoudenCalculations!$J$1)/SQRT(D37^2+$J$6^2),\"\")","v":""},{"$f":"IF(DataEntry!E30>0,D37/$B$14,\"\")","v":""},{"$f":"IF(DataEntry!E30>0,IF(ABS(C37-YoudenCalculations!$J$1)>$S$2,\"yes\",\"\"),\"\")","v":""},{"$f":"IF(DataEntry!H30>0,DataEntry!F30,\"\")","v":""},{"$f":"YoudenCalculations!K31","v":""},{"$f":"IF(DataEntry!H30>0,DataEntry!H30,\"\")","v":""},{"$f":"IF(DataEntry!H30>0,ABS(I37-YoudenCalculations!$K$1)/SQRT(J37^2+$J$11^2),\"\")","v":""},{"$f":"IF(DataEntry!H30>0,J37/$B$14,\"\")","v":""},{"$f":"IF(DataEntry!H30>0,IF(ABS(I37-YoudenCalculations!$K$1)>$T$2,\"yes\",\"\"),\"\")","v":""},null,null,null,null,null,{"$f":"IF(DataEntry!E30>0,IF(G37=\"yes\",\"\",C37),\"\")","v":""},{"$f":"IF(DataEntry!E30>0,IF(M37=\"yes\",\"\",I37),\"\")","v":""},21,{"$f":"IF(DataEntry!E30>0,DataEntry!B30,#N/A)","v":{"$error":"#N/A"}},{"$f":"IF(DataEntry!E30>0,DataEntry!C30,#N/A)","v":{"$error":"#N/A"}},{"$f":"IF(DataEntry!E30>0,DataEntry!D30,#N/A)","v":{"$error":"#N/A"}},{"$f":"IF(DataEntry!E30>0,DataEntry!E30,#N/A)","v":{"$error":"#N/A"}},{"$f":"IF(DataEntry!E30>0,$J$5,#N/A)","v":{"$error":"#N/A"}},{"$error":"#N/A"},{"$error":"#N/A"},null,null,{"$f":"IF(DataEntry!H30>0,DataEntry!B30,#N/A)","v":{"$error":"#N/A"}},{"$f":"IF(DataEntry!H30>0,DataEntry!F30,#N/A)","v":{"$error":"#N/A"}},{"$f":"IF(DataEntry!H30>0,DataEntry!G30,#N/A)","v":{"$error":"#N/A"}},{"$f":"IF(DataEntry!H30>0,DataEntry!H30,#N/A)","v":{"$error":"#N/A"}},{"$f":"IF(DataEntry!H30>0,$J$10,#N/A)","v":{"$error":"#N/A"}},{"$error":"#N/A"},{"$error":"#N/A"},null,null,{"$f":"IF(DataEntry!E30>0,A37,\"\")","v":""},{"$f":"IF(DataEntry!E30>0,E37,#N/A)","v":{"$error":"#N/A"}},{"$f":"IF(DataEntry!H30>0,K37,#N/A)","v":{"$error":"#N/A"}},{"$f":"IF(DataEntry!H30>0,1,#N/A)","v":{"$error":"#N/A"}},null,{"$f":"IF(DataEntry!E30>0,A37,\"\")","v":""},{"$f":"IF(DataEntry!E30>0,F37,#N/A)","v":{"$error":"#N/A"}},{"$f":"IF(DataEntry!H30>0,L37,#N/A)","v":{"$error":"#N/A"}},{"$f":"IF(DataEntry!H30>0,3,#N/A)","v":{"$error":"#N/A"}}]
[{"$f":"YoudenCalculations!I32","v":""},{"$f":"IF(DataEntry!E31>0,DataEntry!C31,\"\")","v":""},{"$f":"YoudenCalculations!J32","v":""},{"$f":"IF(DataEntry!E31>0,DataEntry!E31,\"\")","v":""},{"$f":"IF(DataEntry!E31>0,ABS(C38-YoudenCalculations!$J$1)/SQRT(D38^2+$J$6^2),\"\")","v":""},{"$f":"IF(DataEntry!E31>0,D38/$B$14,\"\")","v":""},{"$f":"IF(DataEntry!E31>0,IF(ABS(C38-YoudenCalculations!$J$1)>$S$2,\"yes\",\"\"),\"\")","v":""},{"$f":"IF(DataEntry!H31>0,DataEntry!F31,\"\")","v":""},{"$f":"YoudenCalculations!K32","v":""},{"$f":"IF(DataEntry!H31>0,DataEntry!H31,\"\")","v":""},{"$f":"IF(DataEntry!H31>0,ABS(I38-YoudenCalculations!$K$1)/SQRT(J38^2+$J$11^2),\"\")","v":""},{"$f":"IF(DataEntry!H31>0,J38/$B$14,\"\")","v":""},{"$f":"IF(DataEntry!H31>0,IF(ABS(I38-YoudenCalculations!$K$1)>$T$2,\"yes\",\"\"),\"\")","v":""},null,null,null,null,null,{"$f":"IF(DataEntry!E31>0,IF(G38=\"yes\",\"\",C38),\"\")","v":""},{"$f":"IF(DataEntry!E31>0,IF(M38=\"yes\",\"\",I38),\"\")","v":""},22,{"$f":"IF(DataEntry!E31>0,DataEntry!B31,#N/A)","v":{"$error":"#N/A"}},{"$f":"IF(DataEntry!E31>0,DataEntry!C31,#N/A)","v":{"$error":"#N/A"}},{"$f":"IF(DataEntry!E31>0,DataEntry!D31,#N/A)","v":{"$error":"#N/A"}},{"$f":"IF(DataEntry!E31>0,DataEntry!E31,#N/A)","v":{"$error":"#N/A"}},{"$f":"IF(DataEntry!E31>0,$J$5,#N/A)","v":{"$error":"#N/A"}},{"$error":"#N/A"},{"$error":"#N/A"},null,null,{"$f":"IF(DataEntry!H31>0,DataEntry!B31,#N/A)","v":{"$error":"#N/A"}},{"$f":"IF(DataEntry!H31>0,DataEntry!F31,#N/A)","v":{"$error":"#N/A"}},{"$f":"IF(DataEntry!H31>0,DataEntry!G31,#N/A)","v":{"$error":"#N/A"}},{"$f":"IF(DataEntry!H31>0,DataEntry!H31,#N/A)","v":{"$error":"#N/A"}},{"$f":"IF(DataEntry!H31>0,$J$10,#N/A)","v":{"$error":"#N/A"}},{"$error":"#N/A"},{"$error":"#N/A"},null,null,{"$f":"IF(DataEntry!E31>0,A38,\"\")","v":""},{"$f":"IF(DataEntry!E31>0,E38,#N/A)","v":{"$error":"#N/A"}},{"$f":"IF(DataEntry!H31>0,K38,#N/A)","v":{"$error":"#N/A"}},{"$f":"IF(DataEntry!H31>0,1,#N/A)","v":{"$error":"#N/A"}},null,{"$f":"IF(DataEntry!E31>0,A38,\"\")","v":""},{"$f":"IF(DataEntry!E31>0,F38,#N/A)","v":{"$error":"#N/A"}},{"$f":"IF(DataEntry!H31>0,L38,#N/A)","v":{"$error":"#N/A"}},{"$f":"IF(DataEntry!H31>0,3,#N/A)","v":{"$error":"#N/A"}}]
[{"$f":"YoudenCalculations!I33","v":""},{"$f":"IF(DataEntry!E32>0,DataEntry!C32,\"\")","v":""},{"$f":"YoudenCalculations!J33","v":""},{"$f":"IF(DataEntry!E32>0,DataEntry!E32,\"\")","v":""},{"$f":"IF(DataEntry!E32>0,ABS(C39-YoudenCalculations!$J$1)/SQRT(D39^2+$J$6^2),\"\")","v":""},{"$f":"IF(DataEntry!E32>0,D39/$B$14,\"\")","v":""},{"$f":"IF(DataEntry!E32>0,IF(ABS(C39-YoudenCalculations!$J$1)>$S$2,\"yes\",\"\"),\"\")","v":""},{"$f":"IF(DataEntry!H32>0,DataEntry!F32,\"\")","v":""},{"$f":"YoudenCalculations!K33","v":""},{"$f":"IF(DataEntry!H32>0,DataEntry!H32,\"\")","v":""},{"$f":"IF(DataEntry!H32>0,ABS(I39-YoudenCalculations!$K$1)/SQRT(J39^2+$J$11^2),\"\")","v":""},{"$f":"IF(DataEntry!H32>0,J39/$B$14,\"\")","v":""},{"$f":"IF(DataEntry!H32>0,IF(ABS(I39-YoudenCalculations!$K$1)>$T$2,\"yes\",\"\"),\"\")","v":""},null,null,null,null,null,{"$f":"IF(DataEntry!E32>0,IF(G39=\"yes\",\"\",C39),\"\")","v":""},{"$f":"IF(DataEntry!E32>0,IF(M39=\"yes\",\"\",I39),\"\")","v":""},23,{"$f":"IF(DataEntry!E32>0,DataEntry!B32,#N/A)","v":{"$error":"#N/A"}},{"$f":"IF(DataEntry!E32>0,DataEntry!C32,#N/A)","v":{"$error":"#N/A"}},{"$f":"IF(DataEntry!E32>0,DataEntry!D32,#N/A)","v":{"$error":"#N/A"}},{"$f":"IF(DataEntry!E32>0,DataEntry!E32,#N/A)","v":{"$error":"#N/A"}},{"$f":"IF(DataEntry!E32>0,$J$5,#N/A)","v":{"$error":"#N/A"}},{"$error":"#N/A"},{"$error":"#N/A"},null,null,{"$f":"IF(DataEntry!H32>0,DataEntry!B32,#N/A)","v":{"$error":"#N/A"}},{"$f":"IF(DataEntry!H32>0,DataEntry!F32,#N/A)","v":{"$error":"#N/A"}},{"$f":"IF(DataEntry!H32>0,DataEntry!G32,#N/A)","v":{"$error":"#N/A"}},{"$f":"IF(DataEntry!H32>0,DataEntry!H32,#N/A)","v":{"$error":"#N/A"}},{"$f":"IF(DataEntry!H32>0,$J$10,#N/A)","v":{"$error":"#N/A"}},{"$error":"#N/A"},{"$error":"#N/A"},null,null,{"$f":"IF(DataEntry!E32>0,A39,\"\")","v":""},{"$f":"IF(DataEntry!E32>0,E39,#N/A)","v":{"$error":"#N/A"}},{"$f":"IF(DataEntry!H32>0,K39,#N/A)","v":{"$error":"#N/A"}},{"$f":"IF(DataEntry!H32>0,1,#N/A)","v":{"$error":"#N/A"}},null,{"$f":"IF(DataEntry!E32>0,A39,\"\")","v":""},{"$f":"IF(DataEntry!E32>0,F39,#N/A)","v":{"$error":"#N/A"}},{"$f":"IF(DataEntry!H32>0,L39,#N/A)","v":{"$error":"#N/A"}},{"$f":"IF(DataEntry!H32>0,3,#N/A)","v":{"$error":"#N/A"}}]
[{"$f":"YoudenCalculations!I34","v":""},{"$f":"IF(DataEntry!E33>0,DataEntry!C33,\"\")","v":""},{"$f":"YoudenCalculations!J34","v":""},{"$f":"IF(DataEntry!E33>0,DataEntry!E33,\"\")","v":""},{"$f":"IF(DataEntry!E33>0,ABS(C40-YoudenCalculations!$J$1)/SQRT(D40^2+$J$6^2),\"\")","v":""},{"$f":"IF(DataEntry!E33>0,D40/$B$14,\"\")","v":""},{"$f":"IF(DataEntry!E33>0,IF(ABS(C40-YoudenCalculations!$J$1)>$S$2,\"yes\",\"\"),\"\")","v":""},{"$f":"IF(DataEntry!H33>0,DataEntry!F33,\"\")","v":""},{"$f":"YoudenCalculations!K34","v":""},{"$f":"IF(DataEntry!H33>0,DataEntry!H33,\"\")","v":""},{"$f":"IF(DataEntry!H33>0,ABS(I40-YoudenCalculations!$K$1)/SQRT(J40^2+$J$11^2),\"\")","v":""},{"$f":"IF(DataEntry!H33>0,J40/$B$14,\"\")","v":""},{"$f":"IF(DataEntry!H33>0,IF(ABS(I40-YoudenCalculations!$K$1)>$T$2,\"yes\",\"\"),\"\")","v":""},null,null,null,null,null,{"$f":"IF(DataEntry!E33>0,IF(G40=\"yes\",\"\",C40),\"\")","v":""},{"$f":"IF(DataEntry!E33>0,IF(M40=\"yes\",\"\",I40),\"\")","v":""},24,{"$f":"IF(DataEntry!E33>0,DataEntry!B33,#N/A)","v":{"$error":"#N/A"}},{"$f":"IF(DataEntry!E33>0,DataEntry!C33,#N/A)","v":{"$error":"#N/A"}},{"$f":"IF(DataEntry!E33>0,DataEntry!D33,#N/A)","v":{"$error":"#N/A"}},{"$f":"IF(DataEntry!E33>0,DataEntry!E33,#N/A)","v":{"$error":"#N/A"}},{"$f":"IF(DataEntry!E33>0,$J$5,#N/A)","v":{"$error":"#N/A"}},{"$error":"#N/A"},{"$error":"#N/A"},null,null,{"$f":"IF(DataEntry!H33>0,DataEntry!B33,#N/A)","v":{"$error":"#N/A"}},{"$f":"IF(DataEntry!H33>0,DataEntry!F33,#N/A)","v":{"$error":"#N/A"}},{"$f":"IF(DataEntry!H33>0,DataEntry!G33,#N/A)","v":{"$error":"#N/A"}},{"$f":"IF(DataEntry!H33>0,DataEntry!H33,#N/A)","v":{"$error":"#N/A"}},{"$f":"IF(DataEntry!H33>0,$J$10,#N/A)","v":{"$error":"#N/A"}},{"$error":"#N/A"},{"$error":"#N/A"},null,null,{"$f":"IF(DataEntry!E33>0,A40,\"\")","v":""},{"$f":"IF(DataEntry!E33>0,E40,#N/A)","v":{"$error":"#N/A"}},{"$f":"IF(DataEntry!H33>0,K40,#N/A)","v":{"$error":"#N/A"}},{"$f":"IF(DataEntry!H33>0,1,#N/A)","v":{"$error":"#N/A"}},null,{"$f":"IF(DataEntry!E33>0,A40,\"\")","v":""},{"$f":"IF(DataEntry!E33>0,F40,#N/A)","v":{"$error":"#N/A"}},{"$f":"IF(DataEntry!H33>0,L40,#N/A)","v":{"$error":"#N/A"}},{"$f":"IF(DataEntry!H33>0,3,#N/A)","v":{"$error":"#N/A"}}]
[{"$f":"YoudenCalculations!I35","v":""},{"$f":"IF(DataEntry!E34>0,DataEntry!C34,\"\")","v":""},{"$f":"YoudenCalculations!J35","v":""},{"$f":"IF(DataEntry!E34>0,DataEntry!E34,\"\")","v":""},{"$f":"IF(DataEntry!E34>0,ABS(C41-YoudenCalculations!$J$1)/SQRT(D41^2+$J$6^2),\"\")","v":""},{"$f":"IF(DataEntry!E34>0,D41/$B$14,\"\")","v":""},{"$f":"IF(DataEntry!E34>0,IF(ABS(C41-YoudenCalculations!$J$1)>$S$2,\"yes\",\"\"),\"\")","v":""},{"$f":"IF(DataEntry!H34>0,DataEntry!F34,\"\")","v":""},{"$f":"YoudenCalculations!K35","v":""},{"$f":"IF(DataEntry!H34>0,DataEntry!H34,\"\")","v":""},{"$f":"IF(DataEntry!H34>0,ABS(I41-YoudenCalculations!$K$1)/SQRT(J41^2+$J$11^2),\"\")","v":""},{"$f":"IF(DataEntry!H34>0,J41/$B$14,\"\")","v":""},{"$f":"IF(DataEntry!H34>0,IF(ABS(I41-YoudenCalculations!$K$1)>$T$2,\"yes\",\"\"),\"\")","v":""},null,null,null,null,null,{"$f":"IF(DataEntry!E34>0,IF(G41=\"yes\",\"\",C41),\"\")","v":""},{"$f":"IF(DataEntry!E34>0,IF(M41=\"yes\",\"\",I41),\"\")","v":""},25,{"$f":"IF(DataEntry!E34>0,DataEntry!B34,#N/A)","v":{"$error":"#N/A"}},{"$f":"IF(DataEntry!E34>0,DataEntry!C34,#N/A)","v":{"$error":"#N/A"}},{"$f":"IF(DataEntry!E34>0,DataEntry!D34,#N/A)","v":{"$error":"#N/A"}},{"$f":"IF(DataEntry!E34>0,DataEntry!E34,#N/A)","v":{"$error":"#N/A"}},{"$f":"IF(DataEntry!E34>0,$J$5,#N/A)","v":{"$error":"#N/A"}},{"$error":"#N/A"},{"$error":"#N/A"},null,null,{"$f":"IF(DataEntry!H34>0,DataEntry!B34,#N/A)","v":{"$error":"#N/A"}},{"$f":"IF(DataEntry!H34>0,DataEntry!F34,#N/A)","v":{"$error":"#N/A"}},{"$f":"IF(DataEntry!H34>0,DataEntry!G34,#N/A)","v":{"$error":"#N/A"}},{"$f":"IF(DataEntry!H34>0,DataEntry!H34,#N/A)","v":{"$error":"#N/A"}},{"$f":"IF(DataEntry!H34>0,$J$10,#N/A)","v":{"$error":"#N/A"}},{"$error":"#N/A"},{"$error":"#N/A"},null,null,{"$f":"IF(DataEntry!E34>0,A41,\"\")","v":""},{"$f":"IF(DataEntry!E34>0,E41,#N/A)","v":{"$error":"#N/A"}},{"$f":"IF(DataEntry!H34>0,K41,#N/A)","v":{"$error":"#N/A"}},{"$f":"IF(DataEntry!H34>0,1,#N/A)","v":{"$error":"#N/A"}},null,{"$f":"IF(DataEntry!E34>0,A41,\"\")","v":""},{"$f":"IF(DataEntry!E34>0,F41,#N/A)","v":{"$error":"#N/A"}},{"$f":"IF(DataEntry!H34>0,L41,#N/A)","v":{"$error":"#N/A"}},{"$f":"IF(DataEntry!H34>0,3,#N/A)","v":{"$error":"#N/A"}}]
[{"$f":"YoudenCalculations!I36","v":""},{"$f":"IF(DataEntry!E35>0,DataEntry!C35,\"\")","v":""},{"$f":"YoudenCalculations!J36","v":""},{"$f":"IF(DataEntry!E35>0,DataEntry!E35,\"\")","v":""},{"$f":"IF(DataEntry!E35>0,ABS(C42-YoudenCalculations!$J$1)/SQRT(D42^2+$J$6^2),\"\")","v":""},{"$f":"IF(DataEntry!E35>0,D42/$B$14,\"\")","v":""},{"$f":"IF(DataEntry!E35>0,IF(ABS(C42-YoudenCalculations!$J$1)>$S$2,\"yes\",\"\"),\"\")","v":""},{"$f":"IF(DataEntry!H35>0,DataEntry!F35,\"\")","v":""},{"$f":"YoudenCalculations!K36","v":""},{"$f":"IF(DataEntry!H35>0,DataEntry!H35,\"\")","v":""},{"$f":"IF(DataEntry!H35>0,ABS(I42-YoudenCalculations!$K$1)/SQRT(J42^2+$J$11^2),\"\")","v":""},{"$f":"IF(DataEntry!H35>0,J42/$B$14,\"\")","v":""},{"$f":"IF(DataEntry!H35>0,IF(ABS(I42-YoudenCalculations!$K$1)>$T$2,\"yes\",\"\"),\"\")","v":""},null,null,null,null,null,{"$f":"IF(DataEntry!E35>0,IF(G42=\"yes\",\"\",C42),\"\")","v":""},{"$f":"IF(DataEntry!E35>0,IF(M42=\"yes\",\"\",I42),\"\")","v":""},26,{"$f":"IF(DataEntry!E35>0,DataEntry!B35,#N/A)","v":{"$error":"#N/A"}},{"$f":"IF(DataEntry!E35>0,DataEntry!C35,#N/A)","v":{"$error":"#N/A"}},{"$f":"IF(DataEntry!E35>0,DataEntry!D35,#N/A)","v":{"$error":"#N/A"}},{"$f":"IF(DataEntry!E35>0,DataEntry!E35,#N/A)","v":{"$error":"#N/A"}},{"$f":"IF(DataEntry!E35>0,$J$5,#N/A)","v":{"$error":"#N/A"}},{"$error":"#N/A"},{"$error":"#N/A"},null,null,{"$f":"IF(DataEntry!H35>0,DataEntry!B35,#N/A)","v":{"$error":"#N/A"}},{"$f":"IF(DataEntry!H35>0,DataEntry!F35,#N/A)","v":{"$error":"#N/A"}},{"$f":"IF(DataEntry!H35>0,DataEntry!G35,#N/A)","v":{"$error":"#N/A"}},{"$f":"IF(DataEntry!H35>0,DataEntry!H35,#N/A)","v":{"$error":"#N/A"}},{"$f":"IF(DataEntry!H35>0,$J$10,#N/A)","v":{"$error":"#N/A"}},{"$error":"#N/A"},{"$error":"#N/A"},null,null,{"$f":"IF(DataEntry!E35>0,A42,\"\")","v":""},{"$f":"IF(DataEntry!E35>0,E42,#N/A)","v":{"$error":"#N/A"}},{"$f":"IF(DataEntry!H35>0,K42,#N/A)","v":{"$error":"#N/A"}},{"$f":"IF(DataEntry!H35>0,1,#N/A)","v":{"$error":"#N/A"}},null,{"$f":"IF(DataEntry!E35>0,A42,\"\")","v":""},{"$f":"IF(DataEntry!E35>0,F42,#N/A)","v":{"$error":"#N/A"}},{"$f":"IF(DataEntry!H35>0,L42,#N/A)","v":{"$error":"#N/A"}},{"$f":"IF(DataEntry!H35>0,3,#N/A)","v":{"$error":"#N/A"}}]
[{"$f":"YoudenCalculations!I37","v":""},{"$f":"IF(DataEntry!E36>0,DataEntry!C36,\"\")","v":""},{"$f":"YoudenCalculations!J37","v":""},{"$f":"IF(DataEntry!E36>0,DataEntry!E36,\"\")","v":""},{"$f":"IF(DataEntry!E36>0,ABS(C43-YoudenCalculations!$J$1)/SQRT(D43^2+$J$6^2),\"\")","v":""},{"$f":"IF(DataEntry!E36>0,D43/$B$14,\"\")","v":""},{"$f":"IF(DataEntry!E36>0,IF(ABS(C43-YoudenCalculations!$J$1)>$S$2,\"yes\",\"\"),\"\")","v":""},{"$f":"IF(DataEntry!H36>0,DataEntry!F36,\"\")","v":""},{"$f":"YoudenCalculations!K37","v":""},{"$f":"IF(DataEntry!H36>0,DataEntry!H36,\"\")","v":""},{"$f":"IF(DataEntry!H36>0,ABS(I43-YoudenCalculations!$K$1)/SQRT(J43^2+$J$11^2),\"\")","v":""},{"$f":"IF(DataEntry!H36>0,J43/$B$14,\"\")","v":""},{"$f":"IF(DataEntry!H36>0,IF(ABS(I43-YoudenCalculations!$K$1)>$T$2,\"yes\",\"\"),\"\")","v":""},null,null,null,null,null,{"$f":"IF(DataEntry!E36>0,IF(G43=\"yes\",\"\",C43),\"\")","v":""},{"$f":"IF(DataEntry!E36>0,IF(M43=\"yes\",\"\",I43),\"\")","v":""},27,{"$f":"IF(DataEntry!E36>0,DataEntry!B36,#N/A)","v":{"$error":"#N/A"}},{"$f":"IF(DataEntry!E36>0,DataEntry!C36,#N/A)","v":{"$error":"#N/A"}},{"$f":"IF(DataEntry!E36>0,DataEntry!D36,#N/A)","v":{"$error":"#N/A"}},{"$f":"IF(DataEntry!E36>0,DataEntry!E36,#N/A)","v":{"$error":"#N/A"}},{"$f":"IF(DataEntry!E36>0,$J$5,#N/A)","v":{"$error":"#N/A"}},{"$error":"#N/A"},{"$error":"#N/A"},null,null,{"$f":"IF(DataEntry!H36>0,DataEntry!B36,#N/A)","v":{"$error":"#N/A"}},{"$f":"IF(DataEntry!H36>0,DataEntry!F36,#N/A)","v":{"$error":"#N/A"}},{"$f":"IF(DataEntry!H36>0,DataEntry!G36,#N/A)","v":{"$error":"#N/A"}},{"$f":"IF(DataEntry!H36>0,DataEntry!H36,#N/A)","v":{"$error":"#N/A"}},{"$f":"IF(DataEntry!H36>0,$J$10,#N/A)","v":{"$error":"#N/A"}},{"$error":"#N/A"},{"$error":"#N/A"},null,null,{"$f":"IF(DataEntry!E36>0,A43,\"\")","v":""},{"$f":"IF(DataEntry!E36>0,E43,#N/A)","v":{"$error":"#N/A"}},{"$f":"IF(DataEntry!H36>0,K43,#N/A)","v":{"$error":"#N/A"}},{"$f":"IF(DataEntry!H36>0,1,#N/A)","v":{"$error":"#N/A"}},null,{"$f":"IF(DataEntry!E36>0,A43,\"\")","v":""},{"$f":"IF(DataEntry!E36>0,F43,#N/A)","v":{"$error":"#N/A"}},{"$f":"IF(DataEntry!H36>0,L43,#N/A)","v":{"$error":"#N/A"}},{"$f":"IF(DataEntry!H36>0,3,#N/A)","v":{"$error":"#N/A"}}]
[{"$f":"YoudenCalculations!I38","v":""},{"$f":"IF(DataEntry!E37>0,DataEntry!C37,\"\")","v":""},{"$f":"YoudenCalculations!J38","v":""},{"$f":"IF(DataEntry!E37>0,DataEntry!E37,\"\")","v":""},{"$f":"IF(DataEntry!E37>0,ABS(C44-YoudenCalculations!$J$1)/SQRT(D44^2+$J$6^2),\"\")","v":""},{"$f":"IF(DataEntry!E37>0,D44/$B$14,\"\")","v":""},{"$f":"IF(DataEntry!E37>0,IF(ABS(C44-YoudenCalculations!$J$1)>$S$2,\"yes\",\"\"),\"\")","v":""},{"$f":"IF(DataEntry!H37>0,DataEntry!F37,\"\")","v":""},{"$f":"YoudenCalculations!K38","v":""},{"$f":"IF(DataEntry!H37>0,DataEntry!H37,\"\")","v":""},{"$f":"IF(DataEntry!H37>0,ABS(I44-YoudenCalculations!$K$1)/SQRT(J44^2+$J$11^2),\"\")","v":""},{"$f":"IF(DataEntry!H37>0,J44/$B$14,\"\")","v":""},{"$f":"IF(DataEntry!H37>0,IF(ABS(I44-YoudenCalculations!$K$1)>$T$2,\"yes\",\"\"),\"\")","v":""},null,null,null,null,null,{"$f":"IF(DataEntry!E37>0,IF(G44=\"yes\",\"\",C44),\"\")","v":""},{"$f":"IF(DataEntry!E37>0,IF(M44=\"yes\",\"\",I44),\"\")","v":""},28,{"$f":"IF(DataEntry!E37>0,DataEntry!B37,#N/A)","v":{"$error":"#N/A"}},{"$f":"IF(DataEntry!E37>0,DataEntry!C37,#N/A)","v":{"$error":"#N/A"}},{"$f":"IF(DataEntry!E37>0,DataEntry!D37,#N/A)","v":{"$error":"#N/A"}},{"$f":"IF(DataEntry!E37>0,DataEntry!E37,#N/A)","v":{"$error":"#N/A"}},{"$f":"IF(DataEntry!E37>0,$J$5,#N/A)","v":{"$error":"#N/A"}},{"$error":"#N/A"},{"$error":"#N/A"},null,null,{"$f":"IF(DataEntry!H37>0,DataEntry!B37,#N/A)","v":{"$error":"#N/A"}},{"$f":"IF(DataEntry!H37>0,DataEntry!F37,#N/A)","v":{"$error":"#N/A"}},{"$f":"IF(DataEntry!H37>0,DataEntry!G37,#N/A)","v":{"$error":"#N/A"}},{"$f":"IF(DataEntry!H37>0,DataEntry!H37,#N/A)","v":{"$error":"#N/A"}},{"$f":"IF(DataEntry!H37>0,$J$10,#N/A)","v":{"$error":"#N/A"}},{"$error":"#N/A"},{"$error":"#N/A"},null,null,{"$f":"IF(DataEntry!E37>0,A44,\"\")","v":""},{"$f":"IF(DataEntry!E37>0,E44,#N/A)","v":{"$error":"#N/A"}},{"$f":"IF(DataEntry!H37>0,K44,#N/A)","v":{"$error":"#N/A"}},{"$f":"IF(DataEntry!H37>0,1,#N/A)","v":{"$error":"#N/A"}},null,{"$f":"IF(DataEntry!E37>0,A44,\"\")","v":""},{"$f":"IF(DataEntry!E37>0,F44,#N/A)","v":{"$error":"#N/A"}},{"$f":"IF(DataEntry!H37>0,L44,#N/A)","v":{"$error":"#N/A"}},{"$f":"IF(DataEntry!H37>0,3,#N/A)","v":{"$error":"#N/A"}}]
[{"$f":"YoudenCalculations!I39","v":""},{"$f":"IF(DataEntry!E38>0,DataEntry!C38,\"\")","v":""},{"$f":"YoudenCalculations!J39","v":""},{"$f":"IF(DataEntry!E38>0,DataEntry!E38,\"\")","v":""},{"$f":"IF(DataEntry!E38>0,ABS(C45-YoudenCalculations!$J$1)/SQRT(D45^2+$J$6^2),\"\")","v":""},{"$f":"IF(DataEntry!E38>0,D45/$B$14,\"\")","v":""},{"$f":"IF(DataEntry!E38>0,IF(ABS(C45-YoudenCalculations!$J$1)>$S$2,\"yes\",\"\"),\"\")","v":""},{"$f":"IF(DataEntry!H38>0,DataEntry!F38,\"\")","v":""},{"$f":"YoudenCalculations!K39","v":""},{"$f":"IF(DataEntry!H38>0,DataEntry!H38,\"\")","v":""},{"$f":"IF(DataEntry!H38>0,ABS(I45-YoudenCalculations!$K$1)/SQRT(J45^2+$J$11^2),\"\")","v":""},{"$f":"IF(DataEntry!H38>0,J45/$B$14,\"\")","v":""},{"$f":"IF(DataEntry!H38>0,IF(ABS(I45-YoudenCalculations!$K$1)>$T$2,\"yes\",\"\"),\"\")","v":""},null,null,null,null,null,{"$f":"IF(DataEntry!E38>0,IF(G45=\"yes\",\"\",C45),\"\")","v":""},{"$f":"IF(DataEntry!E38>0,IF(M45=\"yes\",\"\",I45),\"\")","v":""},29,{"$f":"IF(DataEntry!E38>0,DataEntry!B38,#N/A)","v":{"$error":"#N/A"}},{"$f":"IF(DataEntry!E38>0,DataEntry!C38,#N/A)","v":{"$error":"#N/A"}},{"$f":"IF(DataEntry!E38>0,DataEntry!D38,#N/A)","v":{"$error":"#N/A"}},{"$f":"IF(DataEntry!E38>0,DataEntry!E38,#N/A)","v":{"$error":"#N/A"}},{"$f":"IF(DataEntry!E38>0,$J$5,#N/A)","v":{"$error":"#N/A"}},{"$error":"#N/A"},{"$error":"#N/A"},null,null,{"$f":"IF(DataEntry!H38>0,DataEntry!B38,#N/A)","v":{"$error":"#N/A"}},{"$f":"IF(DataEntry!H38>0,DataEntry!F38,#N/A)","v":{"$error":"#N/A"}},{"$f":"IF(DataEntry!H38>0,DataEntry!G38,#N/A)","v":{"$error":"#N/A"}},{"$f":"IF(DataEntry!H38>0,DataEntry!H38,#N/A)","v":{"$error":"#N/A"}},{"$f":"IF(DataEntry!H38>0,$J$10,#N/A)","v":{"$error":"#N/A"}},{"$error":"#N/A"},{"$error":"#N/A"},null,null,{"$f":"IF(DataEntry!E38>0,A45,\"\")","v":""},{"$f":"IF(DataEntry!E38>0,E45,#N/A)","v":{"$error":"#N/A"}},{"$f":"IF(DataEntry!H38>0,K45,#N/A)","v":{"$error":"#N/A"}},{"$f":"IF(DataEntry!H38>0,1,#N/A)","v":{"$error":"#N/A"}},null,{"$f":"IF(DataEntry!E38>0,A45,\"\")","v":""},{"$f":"IF(DataEntry!E38>0,F45,#N/A)","v":{"$error":"#N/A"}},{"$f":"IF(DataEntry!H38>0,L45,#N/A)","v":{"$error":"#N/A"}},{"$f":"IF(DataEntry!H38>0,3,#N/A)","v":{"$error":"#N/A"}}]
[{"$f":"YoudenCalculations!I40","v":""},{"$f":"IF(DataEntry!E39>0,DataEntry!C39,\"\")","v":""},{"$f":"YoudenCalculations!J40","v":""},{"$f":"IF(DataEntry!E39>0,DataEntry!E39,\"\")","v":""},{"$f":"IF(DataEntry!E39>0,ABS(C46-YoudenCalculations!$J$1)/SQRT(D46^2+$J$6^2),\"\")","v":""},{"$f":"IF(DataEntry!E39>0,D46/$B$14,\"\")","v":""},{"$f":"IF(DataEntry!E39>0,IF(ABS(C46-YoudenCalculations!$J$1)>$S$2,\"yes\",\"\"),\"\")","v":""},{"$f":"IF(DataEntry!H39>0,DataEntry!F39,\"\")","v":""},{"$f":"YoudenCalculations!K40","v":""},{"$f":"IF(DataEntry!H39>0,DataEntry!H39,\"\")","v":""},{"$f":"IF(DataEntry!H39>0,ABS(I46-YoudenCalculations!$K$1)/SQRT(J46^2+$J$11^2),\"\")","v":""},{"$f":"IF(DataEntry!H39>0,J46/$B$14,\"\")","v":""},{"$f":"IF(DataEntry!H39>0,IF(ABS(I46-YoudenCalculations!$K$1)>$T$2,\"yes\",\"\"),\"\")","v":""},null,null,null,null,null,{"$f":"IF(DataEntry!E39>0,IF(G46=\"yes\",\"\",C46),\"\")","v":""},{"$f":"IF(DataEntry!E39>0,IF(M46=\"yes\",\"\",I46),\"\")","v":""},30,{"$f":"IF(DataEntry!E39>0,DataEntry!B39,#N/A)","v":{"$error":"#N/A"}},{"$f":"IF(DataEntry!E39>0,DataEntry!C39,#N/A)","v":{"$error":"#N/A"}},{"$f":"IF(DataEntry!E39>0,DataEntry!D39,#N/A)","v":{"$error":"#N/A"}},{"$f":"IF(DataEntry!E39>0,DataEntry!E39,#N/A)","v":{"$error":"#N/A"}},{"$f":"IF(DataEntry!E39>0,$J$5,#N/A)","v":{"$error":"#N/A"}},{"$error":"#N/A"},{"$error":"#N/A"},null,null,{"$f":"IF(DataEntry!H39>0,DataEntry!B39,#N/A)","v":{"$error":"#N/A"}},{"$f":"IF(DataEntry!H39>0,DataEntry!F39,#N/A)","v":{"$error":"#N/A"}},{"$f":"IF(DataEntry!H39>0,DataEntry!G39,#N/A)","v":{"$error":"#N/A"}},{"$f":"IF(DataEntry!H39>0,DataEntry!H39,#N/A)","v":{"$error":"#N/A"}},{"$f":"IF(DataEntry!H39>0,$J$10,#N/A)","v":{"$error":"#N/A"}},{"$error":"#N/A"},{"$error":"#N/A"},null,null,{"$f":"IF(DataEntry!E39>0,A46,\"\")","v":""},{"$f":"IF(DataEntry!E39>0,E46,#N/A)","v":{"$error":"#N/A"}},{"$f":"IF(DataEntry!H39>0,K46,#N/A)","v":{"$error":"#N/A"}},{"$f":"IF(DataEntry!H39>0,1,#N/A)","v":{"$error":"#N/A"}},null,{"$f":"IF(DataEntry!E39>0,A46,\"\")","v":""},{"$f":"IF(DataEntry!E39>0,F46,#N/A)","v":{"$error":"#N/A"}},{"$f":"IF(DataEntry!H39>0,L46,#N/A)","v":{"$error":"#N/A"}},{"$f":"IF(DataEntry!H39>0,3,#N/A)","v":{"$error":"#N/A"}}]

{"sheet":"YoudenCalculations","index":6,"n_rows":140,"n_cols":31,"rows_kept":140,"cut":false,"hidden":false,"merged":[]}
["DO NOT CHANGE OR EDIT THIS SHEET!",null,null,null,null,null,null,null,{"$f":"IF(DataEntry!B7=\"Median\",YoudenCalculations!I5,IF(DataEntry!B7=\"Mean\",YoudenCalculations!I6,IF(AND(DataEntry!B7=\"NIST\",DataEntry!K1=\"yes\"),I7,\"INPUT ERROR\")))","v":"Median="},{"$f":"IF(DataEntry!B7=\"Median\",YoudenCalculations!J5,IF(DataEntry!B7=\"Mean\",YoudenCalculations!J6,IF(AND(DataEntry!B7=\"NIST\",DataEntry!K1=\"yes\"),DataEntry!K3,\"INPUT ERROR\")))","v":1.5},{"$f":"IF(DataEntry!B7=\"Median\",YoudenCalculations!K5,IF(DataEntry!B7=\"Mean\",YoudenCalculations!K6,IF(AND(DataEntry!B7=\"NIST\",DataEntry!K1=\"yes\"),DataEntry!K6,\"INPUT ERROR\")))","v":-3},null,null,null,null,"s=",{"$f":"SQRT(SUM(Q11:Q40)/(COUNT(Q11:Q40)-1))","v":2.9199571150226551},null,null,null,null,null,null,{"$f":"J10","v":"10 kg #1"},{"$f":"J1","v":1.5},null,null,{"$f":"X1","v":"10 kg #1"},"Y",{"$f":"X2","v":"10 kg #2"},"Systematic"]
[null,null,null,null,null,null,null,null,"Unc",{"$f":"IF(DataEntry!B7=\"Median\",YoudenCalculations!J4,IF(DataEntry!B7=\"Mean\",YoudenCalculations!J4,IF(AND(DataEntry!B7=\"NIST\",DataEntry!K1=\"yes\"),DataEntry!K4,\"INPUT ERROR\")))","v":3.6936238496708271},{"$f":"IF(DataEntry!B7=\"Median\",YoudenCalculations!K4,IF(DataEntry!B7=\"Mean\",YoudenCalculations!K4,IF(AND(DataEntry!B7=\"NIST\",DataEntry!K1=\"yes\"),DataEntry!K7,\"INPUT ERROR\")))","v":10.819955109492302},null,null,null,null,"S*2.45=",{"$f":"Q1*2.45","v":7.1538949318055058},"\"95% confidence\"",null,null,null,null,null,{"$f":"K10","v":"10 kg #2"},{"$f":"K1","v":-3},null,null,{"$f":"$Y$1-Y3","v":-5.6538949318055058},{"$f":"SQRT(ABS(($Y$3^2)-((AB2-$Y$1)^2)))+$Y$2","v":-3}]
[null,null,null,null,null,null,null,null,null,null,null,null,null,null,null,null,null,null,null,null,null,null,null,"radius",{"$f":"Q2","v":7.1538949318055058},{"$f":"Y3/25","v":0.28615579727222024},null,{"$f":"AB2+$Z$3","v":-5.3677391345332852},{"$f":"SQRT(ABS(($Y$3^2)-((AB3-$Y$1)^2)))+$Y$2","v":-0.99690941909445741}]
[null,null,null,null,null,null,null,null,"2sd =",{"$f":"STDEV(J11:J40)*2","v":3.6936238496708271},{"$f":"STDEV(K11:K40)*2","v":10.819955109492302},null,null,null,null,null,null,"Uncertainty Analysis",null,null,null,null,null,null,null,null,null,{"$f":"AB3+$Z$3","v":-5.0815833372610646},-0.19625723897501413]
[null,null,null,null,null,null,null,null,"Median=",{"$f":"MEDIAN(J11:J40)","v":1.5},{"$f":"MEDIAN(K11:K40)","v":-3},null,null,null,null,null,null,"OUT R&S","Both the random and systematic error exceed the uncertainty",null,null,null,null,null,null,null,null,-4.795427539988844,0.39791182699941752]
[null,null,null,null,null,null,null,null,"Mean=",{"$f":"AVERAGE(J11:J40)","v":1.375},{"$f":"AVERAGE(K11:K40)","v":-1.875},null,null,null,null,null,null,"OUT Sys","Only the systematic error exceeds the uncertainty",null,null,null,null,null,null,null,null,-4.5092717427166233,0.88160608736899215]
[null,null,null,null,null,null,null,null,{"$f":"IF(DataEntry!K1=\"yes\",\"NIST\",\"\")","v":""},{"$f":"IF(DataEntry!K1=\"yes\",DataEntry!K3,\"\")","v":""},{"$f":"IF(DataEntry!K1=\"yes\",DataEntry!K6,\"\")","v":""},null,null,null,{"$f":"M11^2","v":0.12500000000000003},null,null,"OUT Ran","Only the random portion of the error exceeds the uncertainty",null,null,null,null,null,null,null,null,-4.2231159454444027,1.2923369590833067]
[null,null,null,null,null,null,null,null,null,null,null,null,null,null,null,null,null,"Warning","Only the summation of the random and systematic errors exceed the uncertainty",null,null,null,null,null,null,null,null,-3.9369601481721825,1.6494813734974807]
[null,null,null,null,null,null,null,null,null,null,null,null,null,null,null,null,null,"IN","The measurement process appears to be within control",null,null,null,null,null,null,null,null,-3.6508043508999624,1.9646175314985257]
[null,null,null,null,null,null,null,null,"Metrologist",{"$f":"DataEntry!B4","v":"10 kg #1"},{"$f":"DataEntry!B5","v":"10 kg #2"},"sys","ran","SYS","RAN",null,"RAN^2","ERROR","Unc","Unc Test",null,null,null,null,null,null,null,-3.3646485536277422,2.2453224062015504]
[null,null,null,null,null,null,null,1,{"$f":"IF(DataEntry!E10>0,DataEntry!B10,\"\")","v":"A"},{"$f":"IF(DataEntry!E10>0,DataEntry!D10,\"\")","v":-2},{"$f":"IF(DataEntry!E10>0,DataEntry!G10,\"\")","v":-7},{"$f":"IF(DataEntry!E10>0,((K11-$K$1)+(J11-$J$1))/SQRT(2),\"\")","v":-5.3033008588991057},{"$f":"IF(DataEntry!E10>0,SQRT((J11-(L11/SQRT(2)+$J$1))^2+(K11-(L11/SQRT(2)+$K$1))^2),\"\")","v":0.35355339059327379},{"$f":"IF(DataEntry!E10>0,IF(L11=0,0,(L11/(ABS(L11)+M11))*R11),\"\")","v":-4.9828808497193675},{"$f":"IF(DataEntry!E10>0,IF(M11=0,0,(M11/(ABS(L11)+M11))*R11),\"\")","v":0.33219205664795787},null,{"$f":"IF(DataEntry!E10>0,O11^2,\"\")","v":0.11035156250000006},{"$f":"IF(DataEntry!E10>0,SQRT((J11-$J$1)^2+(K11-$K$1)^2),\"\")","v":5.315072906367325},{"$f":"IF(DataEntry!E10>0,DataEntry!J10,\"\")","v":5},{"$f":"IF(DataEntry!E10>0,IF(AND(ABS(N11)>S11,ABS(O11)>S11),$R$5,IF(ABS(N11)>S11,$R$6,IF(ABS(O11)>S11,$R$7,IF(ABS(N11)+ABS(O11)>S11,$R$8,$R$9)))),\"\")","v":"Warning"},null,null,null,null,null,null,null,-3.078492756355522,2.4968733635870235]
[null,null,null,null,null,null,null,2,{"$f":"IF(DataEntry!E11>0,DataEntry!B11,\"\")","v":"B"},{"$f":"IF(DataEntry!E11>0,DataEntry!D11,\"\")","v":1},{"$f":"IF(DataEntry!E11>0,DataEntry!G11,\"\")","v":-3},{"$f":"IF(DataEntry!E11>0,((K12-$K$1)+(J12-$J$1))/SQRT(2),\"\")","v":-0.35355339059327373},{"$f":"IF(DataEntry!E11>0,SQRT((J12-(L12/SQRT(2)+$J$1))^2+(K12-(L12/SQRT(2)+$K$1))^2),\"\")","v":0.35355339059327379},{"$f":"IF(DataEntry!E11>0,IF(L12=0,0,(L12/(ABS(L12)+M12))*R12),\"\")","v":-0.25},{"$f":"IF(DataEntry!E11>0,IF(M12=0,0,(M12/(ABS(L12)+M12))*R12),\"\")","v":0.25000000000000006},null,{"$f":"IF(DataEntry!E11>0,O12^2,\"\")","v":6.2500000000000028E-2},{"$f":"IF(DataEntry!E11>0,SQRT((J12-$J$1)^2+(K12-$K$1)^2),\"\")","v":0.5},{"$f":"IF(DataEntry!E11>0,DataEntry!J11,\"\")","v":8},{"$f":"IF(DataEntry!E11>0,IF(AND(ABS(N12)>S12,ABS(O12)>S12),$R$5,IF(ABS(N12)>S12,$R$6,IF(ABS(O12)>S12,$R$7,IF(ABS(N12)+ABS(O12)>S12,$R$8,$R$9)))),\"\")","v":"IN"},null,null,null,null,null,null,null,-2.7923369590833018,2.7231159454444054]
[null,null,null,null,null,null,null,3,{"$f":"IF(DataEntry!E12>0,DataEntry!B12,\"\")","v":"C"},{"$f":"IF(DataEntry!E12>0,DataEntry!D12,\"\")","v":4},{"$f":"IF(DataEntry!E12>0,DataEntry!G12,\"\")","v":-8},{"$f":"IF(DataEntry!E12>0,((K13-$K$1)+(J13-$J$1))/SQRT(2),\"\")","v":-1.7677669529663687},{"$f":"IF(DataEntry!E12>0,SQRT((J13-(L13/SQRT(2)+$J$1))^2+(K13-(L13/SQRT(2)+$K$1))^2),\"\")","v":5.3033008588991066},{"$f":"IF(DataEntry!E12>0,IF(L13=0,0,(L13/(ABS(L13)+M13))*R13),\"\")","v":-1.3975424859373684},{"$f":"IF(DataEntry!E12>0,IF(M13=0,0,(M13/(ABS(L13)+M13))*R13),\"\")","v":4.1926274578121063},null,{"$f":"IF(DataEntry!E12>0,O13^2,\"\")","v":17.578125000000007},{"$f":"IF(DataEntry!E12>0,SQRT((J13-$J$1)^2+(K13-$K$1)^2),\"\")","v":5.5901699437494745},{"$f":"IF(DataEntry!E12>0,DataEntry!J12,\"\")","v":6},{"$f":"IF(DataEntry!E12>0,IF(AND(ABS(N13)>S13,ABS(O13)>S13),$R$5,IF(ABS(N13)>S13,$R$6,IF(ABS(O13)>S13,$R$7,IF(ABS(N13)+ABS(O13)>S13,$R$8,$R$9)))),\"\")","v":"IN"},null,null,null,null,null,null,null,-2.5061811618110816,2.9269490628874575]
[null,null,null,null,null,null,null,4,{"$f":"IF(DataEntry!E13>0,DataEntry!B13,\"\")","v":"D"},{"$f":"IF(DataEntry!E13>0,DataEntry!D13,\"\")","v":3},{"$f":"IF(DataEntry!E13>0,DataEntry!G13,\"\")","v":9},{"$f":"IF(DataEntry!E13>0,((K14-$K$1)+(J14-$J$1))/SQRT(2),\"\")","v":9.5459415460183905},{"$f":"IF(DataEntry!E13>0,SQRT((J14-(L14/SQRT(2)+$J$1))^2+(K14-(L14/SQRT(2)+$K$1))^2),\"\")","v":7.4246212024587503},{"$f":"IF(DataEntry!E13>0,IF(L14=0,0,(L14/(ABS(L14)+M14))*R14),\"\")","v":6.8025299751268991},{"$f":"IF(DataEntry!E13>0,IF(M14=0,0,(M14/(ABS(L14)+M14))*R14),\"\")","v":5.2908566473209229},null,{"$f":"IF(DataEntry!E13>0,O14^2,\"\")","v":27.993164062499996},{"$f":"IF(DataEntry!E13>0,SQRT((J14-$J$1)^2+(K14-$K$1)^2),\"\")","v":12.093386622447824},{"$f":"IF(DataEntry!E13>0,DataEntry!J13,\"\")","v":4},{"$f":"IF(DataEntry!E13>0,IF(AND(ABS(N14)>S14,ABS(O14)>S14),$R$5,IF(ABS(N14)>S14,$R$6,IF(ABS(O14)>S14,$R$7,IF(ABS(N14)+ABS(O14)>S14,$R$8,$R$9)))),\"\")","v":"OUT R&S"},null,null,null,null,null,null,null,-2.2200253645388615,3.1106156794958082]
[null,null,null,null,null,null,null,5,{"$f":"IF(DataEntry!E14>0,DataEntry!B14,\"\")","v":"E"},{"$f":"IF(DataEntry!E14>0,DataEntry!D14,\"\")","v":2},{"$f":"IF(DataEntry!E14>0,DataEntry!G14,\"\")","v":-4},{"$f":"IF(DataEntry!E14>0,((K15-$K$1)+(J15-$J$1))/SQRT(2),\"\")","v":-0.35355339059327373},{"$f":"IF(DataEntry!E14>0,SQRT((J15-(L15/SQRT(2)+$J$1))^2+(K15-(L15/SQRT(2)+$K$1))^2),\"\")","v":1.0606601717798212},{"$f":"IF(DataEntry!E14>0,IF(L15=0,0,(L15/(ABS(L15)+M15))*R15),\"\")","v":-0.27950849718747373},{"$f":"IF(DataEntry!E14>0,IF(M15=0,0,(M15/(ABS(L15)+M15))*R15),\"\")","v":0.83852549156242118},null,{"$f":"IF(DataEntry!E14>0,O15^2,\"\")","v":0.70312500000000011},{"$f":"IF(DataEntry!E14>0,SQRT((J15-$J$1)^2+(K15-$K$1)^2),\"\")","v":1.1180339887498949},{"$f":"IF(DataEntry!E14>0,DataEntry!J14,\"\")","v":2},{"$f":"IF(DataEntry!E14>0,IF(AND(ABS(N15)>S15,ABS(O15)>S15),$R$5,IF(ABS(N15)>S15,$R$6,IF(ABS(O15)>S15,$R$7,IF(ABS(N15)+ABS(O15)>S15,$R$8,$R$9)))),\"\")","v":"IN"},null,null,null,null,null,null,null,-1.9338695672666413,3.27588658998173]
[null,null,null,null,null,null,null,6,{"$f":"IF(DataEntry!E15>0,DataEntry!B15,\"\")","v":"F"},{"$f":"IF(DataEntry!E15>0,DataEntry!D15,\"\")","v":0},{"$f":"IF(DataEntry!E15>0,DataEntry!G15,\"\")","v":2},{"$f":"IF(DataEntry!E15>0,((K16-$K$1)+(J16-$J$1))/SQRT(2),\"\")","v":2.4748737341529163},{"$f":"IF(DataEntry!E15>0,SQRT((J16-(L16/SQRT(2)+$J$1))^2+(K16-(L16/SQRT(2)+$K$1))^2),\"\")","v":4.5961940777125587},{"$f":"IF(DataEntry!E15>0,IF(L16=0,0,(L16/(ABS(L16)+M16))*R16),\"\")","v":1.8270536390593461},{"$f":"IF(DataEntry!E15>0,IF(M16=0,0,(M16/(ABS(L16)+M16))*R16),\"\")","v":3.3930996153959283},null,{"$f":"IF(DataEntry!E15>0,O16^2,\"\")","v":11.513124999999997},{"$f":"IF(DataEntry!E15>0,SQRT((J16-$J$1)^2+(K16-$K$1)^2),\"\")","v":5.2201532544552753},{"$f":"IF(DataEntry!E15>0,DataEntry!J15,\"\")","v":7},{"$f":"IF(DataEntry!E15>0,IF(AND(ABS(N16)>S16,ABS(O16)>S16),$R$5,IF(ABS(N16)>S16,$R$6,IF(ABS(O16)>S16,$R$7,IF(ABS(N16)+ABS(O16)>S16,$R$8,$R$9)))),\"\")","v":"IN"},null,null,null,null,null,null,null,-1.6477137699944211,3.4241817157907368]
[null,null,null,null,null,null,null,7,{"$f":"IF(DataEntry!E16>0,DataEntry!B16,\"\")","v":"G"},{"$f":"IF(DataEntry!E16>0,DataEntry!D16,\"\")","v":1},{"$f":"IF(DataEntry!E16>0,DataEntry!G16,\"\")","v":-1},{"$f":"IF(DataEntry!E16>0,((K17-$K$1)+(J17-$J$1))/SQRT(2),\"\")","v":1.0606601717798212},{"$f":"IF(DataEntry!E16>0,SQRT((J17-(L17/SQRT(2)+$J$1))^2+(K17-(L17/SQRT(2)+$K$1))^2),\"\")","v":1.7677669529663689},{"$f":"IF(DataEntry!E16>0,IF(L17=0,0,(L17/(ABS(L17)+M17))*R17),\"\")","v":0.7730823048033113},{"$f":"IF(DataEntry!E16>0,IF(M17=0,0,(M17/(ABS(L17)+M17))*R17),\"\")","v":1.2884705080055192},null,{"$f":"IF(DataEntry!E16>0,O17^2,\"\")","v":1.6601562500000007},{"$f":"IF(DataEntry!E16>0,SQRT((J17-$J$1)^2+(K17-$K$1)^2),\"\")","v":2.0615528128088303},{"$f":"IF(DataEntry!E16>0,DataEntry!J16,\"\")","v":5},{"$f":"IF(DataEntry!E16>0,IF(AND(ABS(N17)>S17,ABS(O17)>S17),$R$5,IF(ABS(N17)>S17,$R$6,IF(ABS(O17)>S17,$R$7,IF(ABS(N17)+ABS(O17)>S17,$R$8,$R$9)))),\"\")","v":"IN"},null,null,null,null,null,null,null,-1.3615579727222009,3.5566530077519358]
[null,null,null,null,null,null,null,8,{"$f":"IF(DataEntry!E17>0,DataEntry!B17,\"\")","v":"H"},{"$f":"IF(DataEntry!E17>0,DataEntry!D17,\"\")","v":2},{"$f":"IF(DataEntry!E17>0,DataEntry!G17,\"\")","v":-3},{"$f":"IF(DataEntry!E17>0,((K18-$K$1)+(J18-$J$1))/SQRT(2),\"\")","v":0.35355339059327373},{"$f":"IF(DataEntry!E17>0,SQRT((J18-(L18/SQRT(2)+$J$1))^2+(K18-(L18/SQRT(2)+$K$1))^2),\"\")","v":0.35355339059327379},{"$f":"IF(DataEntry!E17>0,IF(L18=0,0,(L18/(ABS(L18)+M18))*R18),\"\")","v":0.25},{"$f":"IF(DataEntry!E17>0,IF(M18=0,0,(M18/(ABS(L18)+M18))*R18),\"\")","v":0.25000000000000006},null,{"$f":"IF(DataEntry!E17>0,O18^2,\"\")","v":6.2500000000000028E-2},{"$f":"IF(DataEntry!E17>0,SQRT((J18-$J$1)^2+(K18-$K$1)^2),\"\")","v":0.5},{"$f":"IF(DataEntry!E17>0,DataEntry!J17,\"\")","v":9},{"$f":"IF(DataEntry!E17>0,IF(AND(ABS(N18)>S18,ABS(O18)>S18),$R$5,IF(ABS(N18)>S18,$R$6,IF(ABS(O18)>S18,$R$7,IF(ABS(N18)+ABS(O18)>S18,$R$8,$R$9)))),\"\")","v":"IN"},null,null,null,null,null,null,null,-1.0754021754499807,3.6742427533016819]
[null,null,null,null,null,null,null,9,{"$f":"IF(DataEntry!E18>0,DataEntry!B18,\"\")","v":""},{"$f":"IF(DataEntry!E18>0,DataEntry!D18,\"\")","v":""},{"$f":"IF(DataEntry!E18>0,DataEntry!G18,\"\")","v":""},{"$f":"IF(DataEntry!E18>0,((K19-$K$1)+(J19-$J$1))/SQRT(2),\"\")","v":""},{"$f":"IF(DataEntry!E18>0,SQRT((J19-(L19/SQRT(2)+$J$1))^2+(K19-(L19/SQRT(2)+$K$1))^2),\"\")","v":""},{"$f":"IF(DataEntry!E18>0,IF(L19=0,0,(L19/(ABS(L19)+M19))*R19),\"\")","v":""},{"$f":"IF(DataEntry!E18>0,IF(M19=0,0,(M19/(ABS(L19)+M19))*R19),\"\")","v":""},null,{"$f":"IF(DataEntry!E18>0,O19^2,\"\")","v":""},{"$f":"IF(DataEntry!E18>0,SQRT((J19-$J$1)^2+(K19-$K$1)^2),\"\")","v":""},{"$f":"IF(DataEntry!E18>0,DataEntry!J18,\"\")","v":""},{"$f":"IF(DataEntry!E18>0,IF(AND(ABS(N19)>S19,ABS(O19)>S19),$R$5,IF(ABS(N19)>S19,$R$6,IF(ABS(O19)>S19,$R$7,IF(ABS(N19)+ABS(O19)>S19,$R$8,$R$9)))),\"\")","v":""},null,null,null,null,null,null,null,-0.78924637817776055,3.7777255562107639]
[null,null,null,null,null,null,null,10,{"$f":"IF(DataEntry!E19>0,DataEntry!B19,\"\")","v":""},{"$f":"IF(DataEntry!E19>0,DataEntry!D19,\"\")","v":""},{"$f":"IF(DataEntry!E19>0,DataEntry!G19,\"\")","v":""},{"$f":"IF(DataEntry!E19>0,((K20-$K$1)+(J20-$J$1))/SQRT(2),\"\")","v":""},{"$f":"IF(DataEntry!E19>0,SQRT((J20-(L20/SQRT(2)+$J$1))^2+(K20-(L20/SQRT(2)+$K$1))^2),\"\")","v":""},{"$f":"IF(DataEntry!E19>0,IF(L20=0,0,(L20/(ABS(L20)+M20))*R20),\"\")","v":""},{"$f":"IF(DataEntry!E19>0,IF(M20=0,0,(M20/(ABS(L20)+M20))*R20),\"\")","v":""},null,{"$f":"IF(DataEntry!E19>0,O20^2,\"\")","v":""},{"$f":"IF(DataEntry!E19>0,SQRT((J20-$J$1)^2+(K20-$K$1)^2),\"\")","v":""},{"$f":"IF(DataEntry!E19>0,DataEntry!J19,\"\")","v":""},{"$f":"IF(DataEntry!E19>0,IF(AND(ABS(N20)>S20,ABS(O20)>S20),$R$5,IF(ABS(N20)>S20,$R$6,IF(ABS(O20)>S20,$R$7,IF(ABS(N20)+ABS(O20)>S20,$R$8,$R$9)))),\"\")","v":""},null,null,null,null,null,null,null,-0.50309058090554037,3.8677391345332861]
[null,null,null,null,null,null,null,11,{"$f":"IF(DataEntry!E20>0,DataEntry!B20,\"\")","v":""},{"$f":"IF(DataEntry!E20>0,DataEntry!D20,\"\")","v":""},{"$f":"IF(DataEntry!E20>0,DataEntry!G20,\"\")","v":""},{"$f":"IF(DataEntry!E20>0,((K21-$K$1)+(J21-$J$1))/SQRT(2),\"\")","v":""},{"$f":"IF(DataEntry!E20>0,SQRT((J21-(L21/SQRT(2)+$J$1))^2+(K21-(L21/SQRT(2)+$K$1))^2),\"\")","v":""},{"$f":"IF(DataEntry!E20>0,IF(L21=0,0,(L21/(ABS(L21)+M21))*R21),\"\")","v":""},{"$f":"IF(DataEntry!E20>0,IF(M21=0,0,(M21/(ABS(L21)+M21))*R21),\"\")","v":""},null,{"$f":"IF(DataEntry!E20>0,O21^2,\"\")","v":""},{"$f":"IF(DataEntry!E20>0,SQRT((J21-$J$1)^2+(K21-$K$1)^2),\"\")","v":""},{"$f":"IF(DataEntry!E20>0,DataEntry!J20,\"\")","v":""},{"$f":"IF(DataEntry!E20>0,IF(AND(ABS(N21)>S21,ABS(O21)>S21),$R$5,IF(ABS(N21)>S21,$R$6,IF(ABS(O21)>S21,$R$7,IF(ABS(N21)+ABS(O21)>S21,$R$8,$R$9)))),\"\")","v":""},null,null,null,null,null,null,null,-0.21693478363332014,3.9448072431178751]
[null,null,null,null,null,null,null,12,{"$f":"IF(DataEntry!E21>0,DataEntry!B21,\"\")","v":""},{"$f":"IF(DataEntry!E21>0,DataEntry!D21,\"\")","v":""},{"$f":"IF(DataEntry!E21>0,DataEntry!G21,\"\")","v":""},{"$f":"IF(DataEntry!E21>0,((K22-$K$1)+(J22-$J$1))/SQRT(2),\"\")","v":""},{"$f":"IF(DataEntry!E21>0,SQRT((J22-(L22/SQRT(2)+$J$1))^2+(K22-(L22/SQRT(2)+$K$1))^2),\"\")","v":""},{"$f":"IF(DataEntry!E21>0,IF(L22=0,0,(L22/(ABS(L22)+M22))*R22),\"\")","v":""},{"$f":"IF(DataEntry!E21>0,IF(M22=0,0,(M22/(ABS(L22)+M22))*R22),\"\")","v":""},null,{"$f":"IF(DataEntry!E21>0,O22^2,\"\")","v":""},{"$f":"IF(DataEntry!E21>0,SQRT((J22-$J$1)^2+(K22-$K$1)^2),\"\")","v":""},{"$f":"IF(DataEntry!E21>0,DataEntry!J21,\"\")","v":""},{"$f":"IF(DataEntry!E21>0,IF(AND(ABS(N22)>S22,ABS(O22)>S22),$R$5,IF(ABS(N22)>S22,$R$6,IF(ABS(O22)>S22,$R$7,IF(ABS(N22)+ABS(O22)>S22,$R$8,$R$9)))),\"\")","v":""},null,null,null,null,null,null,null,6.9221013638900097E-2,4.0093569025624607]
[null,null,null,null,null,null,null,13,{"$f":"IF(DataEntry!E22>0,DataEntry!B22,\"\")","v":""},{"$f":"IF(DataEntry!E22>0,DataEntry!D22,\"\")","v":""},{"$f":"IF(DataEntry!E22>0,DataEntry!G22,\"\")","v":""},{"$f":"IF(DataEntry!E22>0,((K23-$K$1)+(J23-$J$1))/SQRT(2),\"\")","v":""},{"$f":"IF(DataEntry!E22>0,SQRT((J23-(L23/SQRT(2)+$J$1))^2+(K23-(L23/SQRT(2)+$K$1))^2),\"\")","v":""},{"$f":"IF(DataEntry!E22>0,IF(L23=0,0,(L23/(ABS(L23)+M23))*R23),\"\")","v":""},{"$f":"IF(DataEntry!E22>0,IF(M23=0,0,(M23/(ABS(L23)+M23))*R23),\"\")","v":""},null,{"$f":"IF(DataEntry!E22>0,O23^2,\"\")","v":""},{"$f":"IF(DataEntry!E22>0,SQRT((J23-$J$1)^2+(K23-$K$1)^2),\"\")","v":""},{"$f":"IF(DataEntry!E22>0,DataEntry!J22,\"\")","v":""},{"$f":"IF(DataEntry!E22>0,IF(AND(ABS(N23)>S23,ABS(O23)>S23),$R$5,IF(ABS(N23)>S23,$R$6,IF(ABS(O23)>S23,$R$7,IF(ABS(N23)+ABS(O23)>S23,$R$8,$R$9)))),\"\")","v":""},null,null,null,null,null,null,null,0.35537681091112033,4.0617314059876639]
[null,null,null,null,null,null,null,14,{"$f":"IF(DataEntry!E23>0,DataEntry!B23,\"\")","v":""},{"$f":"IF(DataEntry!E23>0,DataEntry!D23,\"\")","v":""},{"$f":"IF(DataEntry!E23>0,DataEntry!G23,\"\")","v":""},{"$f":"IF(DataEntry!E23>0,((K24-$K$1)+(J24-$J$1))/SQRT(2),\"\")","v":""},{"$f":"IF(DataEntry!E23>0,SQRT((J24-(L24/SQRT(2)+$J$1))^2+(K24-(L24/SQRT(2)+$K$1))^2),\"\")","v":""},{"$f":"IF(DataEntry!E23>0,IF(L24=0,0,(L24/(ABS(L24)+M24))*R24),\"\")","v":""},{"$f":"IF(DataEntry!E23>0,IF(M24=0,0,(M24/(ABS(L24)+M24))*R24),\"\")","v":""},null,{"$f":"IF(DataEntry!E23>0,O24^2,\"\")","v":""},{"$f":"IF(DataEntry!E23>0,SQRT((J24-$J$1)^2+(K24-$K$1)^2),\"\")","v":""},{"$f":"IF(DataEntry!E23>0,DataEntry!J23,\"\")","v":""},{"$f":"IF(DataEntry!E23>0,IF(AND(ABS(N24)>S24,ABS(O24)>S24),$R$5,IF(ABS(N24)>S24,$R$6,IF(ABS(O24)>S24,$R$7,IF(ABS(N24)+ABS(O24)>S24,$R$8,$R$9)))),\"\")","v":""},null,null,null,null,null,null,null,0.64153260818334057,4.1022001121131471]
[null,null,null,null,null,null,null,15,{"$f":"IF(DataEntry!E24>0,DataEntry!B24,\"\")","v":""},{"$f":"IF(DataEntry!E24>0,DataEntry!D24,\"\")","v":""},{"$f":"IF(DataEntry!E24>0,DataEntry!G24,\"\")","v":""},{"$f":"IF(DataEntry!E24>0,((K25-$K$1)+(J25-$J$1))/SQRT(2),\"\")","v":""},{"$f":"IF(DataEntry!E24>0,SQRT((J25-(L25/SQRT(2)+$J$1))^2+(K25-(L25/SQRT(2)+$K$1))^2),\"\")","v":""},{"$f":"IF(DataEntry!E24>0,IF(L25=0,0,(L25/(ABS(L25)+M25))*R25),\"\")","v":""},{"$f":"IF(DataEntry!E24>0,IF(M25=0,0,(M25/(ABS(L25)+M25))*R25),\"\")","v":""},null,{"$f":"IF(DataEntry!E24>0,O25^2,\"\")","v":""},{"$f":"IF(DataEntry!E24>0,SQRT((J25-$J$1)^2+(K25-$K$1)^2),\"\")","v":""},{"$f":"IF(DataEntry!E24>0,DataEntry!J24,\"\")","v":""},{"$f":"IF(DataEntry!E24>0,IF(AND(ABS(N25)>S25,ABS(O25)>S25),$R$5,IF(ABS(N25)>S25,$R$6,IF(ABS(O25)>S25,$R$7,IF(ABS(N25)+ABS(O25)>S25,$R$8,$R$9)))),\"\")","v":""},null,null,null,null,null,null,null,0.92768840545556075,4.1309657224013145]
[null,null,null,null,null,null,null,16,{"$f":"IF(DataEntry!E25>0,DataEntry!B25,\"\")","v":""},{"$f":"IF(DataEntry!E25>0,DataEntry!D25,\"\")","v":""},{"$f":"IF(DataEntry!E25>0,DataEntry!G25,\"\")","v":""},{"$f":"IF(DataEntry!E25>0,((K26-$K$1)+(J26-$J$1))/SQRT(2),\"\")","v":""},{"$f":"IF(DataEntry!E25>0,SQRT((J26-(L26/SQRT(2)+$J$1))^2+(K26-(L26/SQRT(2)+$K$1))^2),\"\")","v":""},{"$f":"IF(DataEntry!E25>0,IF(L26=0,0,(L26/(ABS(L26)+M26))*R26),\"\")","v":""},{"$f":"IF(DataEntry!E25>0,IF(M26=0,0,(M26/(ABS(L26)+M26))*R26),\"\")","v":""},null,{"$f":"IF(DataEntry!E25>0,O26^2,\"\")","v":""},{"$f":"IF(DataEntry!E25>0,SQRT((J26-$J$1)^2+(K26-$K$1)^2),\"\")","v":""},{"$f":"IF(DataEntry!E25>0,DataEntry!J25,\"\")","v":""},{"$f":"IF(DataEntry!E25>0,IF(AND(ABS(N26)>S26,ABS(O26)>S26),$R$5,IF(ABS(N26)>S26,$R$6,IF(ABS(O26)>S26,$R$7,IF(ABS(N26)+ABS(O26)>S26,$R$8,$R$9)))),\"\")","v":""},null,null,null,null,null,null,null,1.2138442027277809,4.1481695247804522]
[null,null,null,null,null,null,null,17,{"$f":"IF(DataEntry!E26>0,DataEntry!B26,\"\")","v":""},{"$f":"IF(DataEntry!E26>0,DataEntry!D26,\"\")","v":""},{"$f":"IF(DataEntry!E26>0,DataEntry!G26,\"\")","v":""},{"$f":"IF(DataEntry!E26>0,((K27-$K$1)+(J27-$J$1))/SQRT(2),\"\")","v":""},{"$f":"IF(DataEntry!E26>0,SQRT((J27-(L27/SQRT(2)+$J$1))^2+(K27-(L27/SQRT(2)+$K$1))^2),\"\")","v":""},{"$f":"IF(DataEntry!E26>0,IF(L27=0,0,(L27/(ABS(L27)+M27))*R27),\"\")","v":""},{"$f":"IF(DataEntry!E26>0,IF(M27=0,0,(M27/(ABS(L27)+M27))*R27),\"\")","v":""},null,{"$f":"IF(DataEntry!E26>0,O27^2,\"\")","v":""},{"$f":"IF(DataEntry!E26>0,SQRT((J27-$J$1)^2+(K27-$K$1)^2),\"\")","v":""},{"$f":"IF(DataEntry!E26>0,DataEntry!J26,\"\")","v":""},{"$f":"IF(DataEntry!E26>0,IF(AND(ABS(N27)>S27,ABS(O27)>S27),$R$5,IF(ABS(N27)>S27,$R$6,IF(ABS(O27)>S27,$R$7,IF(ABS(N27)+ABS(O27)>S27,$R$8,$R$9)))),\"\")","v":""},null,null,null,null,null,null,null,1.5000000000000011,4.1538949318055058]
[null,null,null,null,null,null,null,18,{"$f":"IF(DataEntry!E27>0,DataEntry!B27,\"\")","v":""},{"$f":"IF(DataEntry!E27>0,DataEntry!D27,\"\")","v":""},{"$f":"IF(DataEntry!E27>0,DataEntry!G27,\"\")","v":""},{"$f":"IF(DataEntry!E27>0,((K28-$K$1)+(J28-$J$1))/SQRT(2),\"\")","v":""},{"$f":"IF(DataEntry!E27>0,SQRT((J28-(L28/SQRT(2)+$J$1))^2+(K28-(L28/SQRT(2)+$K$1))^2),\"\")","v":""},{"$f":"IF(DataEntry!E27>0,IF(L28=0,0,(L28/(ABS(L28)+M28))*R28),\"\")","v":""},{"$f":"IF(DataEntry!E27>0,IF(M28=0,0,(M28/(ABS(L28)+M28))*R28),\"\")","v":""},null,{"$f":"IF(DataEntry!E27>0,O28^2,\"\")","v":""},{"$f":"IF(DataEntry!E27>0,SQRT((J28-$J$1)^2+(K28-$K$1)^2),\"\")","v":""},{"$f":"IF(DataEntry!E27>0,DataEntry!J27,\"\")","v":""},{"$f":"IF(DataEntry!E27>0,IF(AND(ABS(N28)>S28,ABS(O28)>S28),$R$5,IF(ABS(N28)>S28,$R$6,IF(ABS(O28)>S28,$R$7,IF(ABS(N28)+ABS(O28)>S28,$R$8,$R$9)))),\"\")","v":""},null,null,null,null,null,null,null,1.7861557972722213,4.1481695247804522]
[null,null,null,null,null,null,null,19,{"$f":"IF(DataEntry!E28>0,DataEntry!B28,\"\")","v":""},{"$f":"IF(DataEntry!E28>0,DataEntry!D28,\"\")","v":""},{"$f":"IF(DataEntry!E28>0,DataEntry!G28,\"\")","v":""},{"$f":"IF(DataEntry!E28>0,((K29-$K$1)+(J29-$J$1))/SQRT(2),\"\")","v":""},{"$f":"IF(DataEntry!E28>0,SQRT((J29-(L29/SQRT(2)+$J$1))^2+(K29-(L29/SQRT(2)+$K$1))^2),\"\")","v":""},{"$f":"IF(DataEntry!E28>0,IF(L29=0,0,(L29/(ABS(L29)+M29))*R29),\"\")","v":""},{"$f":"IF(DataEntry!E28>0,IF(M29=0,0,(M29/(ABS(L29)+M29))*R29),\"\")","v":""},null,{"$f":"IF(DataEntry!E28>0,O29^2,\"\")","v":""},{"$f":"IF(DataEntry!E28>0,SQRT((J29-$J$1)^2+(K29-$K$1)^2),\"\")","v":""},{"$f":"IF(DataEntry!E28>0,DataEntry!J28,\"\")","v":""},{"$f":"IF(DataEntry!E28>0,IF(AND(ABS(N29)>S29,ABS(O29)>S29),$R$5,IF(ABS(N29)>S29,$R$6,IF(ABS(O29)>S29,$R$7,IF(ABS(N29)+ABS(O29)>S29,$R$8,$R$9)))),\"\")","v":""},null,null,null,null,null,null,null,2.0723115945444417,4.1309657224013145]
[null,null,null,null,null,null,null,20,{"$f":"IF(DataEntry!E29>0,DataEntry!B29,\"\")","v":""},{"$f":"IF(DataEntry!E29>0,DataEntry!D29,\"\")","v":""},{"$f":"IF(DataEntry!E29>0,DataEntry!G29,\"\")","v":""},{"$f":"IF(DataEntry!E29>0,((K30-$K$1)+(J30-$J$1))/SQRT(2),\"\")","v":""},{"$f":"IF(DataEntry!E29>0,SQRT((J30-(L30/SQRT(2)+$J$1))^2+(K30-(L30/SQRT(2)+$K$1))^2),\"\")","v":""},{"$f":"IF(DataEntry!E29>0,IF(L30=0,0,(L30/(ABS(L30)+M30))*R30),\"\")","v":""},{"$f":"IF(DataEntry!E29>0,IF(M30=0,0,(M30/(ABS(L30)+M30))*R30),\"\")","v":""},null,{"$f":"IF(DataEntry!E29>0,O30^2,\"\")","v":""},{"$f":"IF(DataEntry!E29>0,SQRT((J30-$J$1)^2+(K30-$K$1)^2),\"\")","v":""},{"$f":"IF(DataEntry!E29>0,DataEntry!J29,\"\")","v":""},{"$f":"IF(DataEntry!E29>0,IF(AND(ABS(N30)>S30,ABS(O30)>S30),$R$5,IF(ABS(N30)>S30,$R$6,IF(ABS(O30)>S30,$R$7,IF(ABS(N30)+ABS(O30)>S30,$R$8,$R$9)))),\"\")","v":""},null,null,null,null,null,null,null,2.3584673918166619,4.1022001121131471]
[null,null,null,null,null,null,null,21,{"$f":"IF(DataEntry!E30>0,DataEntry!B30,\"\")","v":""},{"$f":"IF(DataEntry!E30>0,DataEntry!D30,\"\")","v":""},{"$f":"IF(DataEntry!E30>0,DataEntry!G30,\"\")","v":""},{"$f":"IF(DataEntry!E30>0,((K31-$K$1)+(J31-$J$1))/SQRT(2),\"\")","v":""},{"$f":"IF(DataEntry!E30>0,SQRT((J31-(L31/SQRT(2)+$J$1))^2+(K31-(L31/SQRT(2)+$K$1))^2),\"\")","v":""},{"$f":"IF(DataEntry!E30>0,IF(L31=0,0,(L31/(ABS(L31)+M31))*R31),\"\")","v":""},{"$f":"IF(DataEntry!E30>0,IF(M31=0,0,(M31/(ABS(L31)+M31))*R31),\"\")","v":""},null,{"$f":"IF(DataEntry!E30>0,O31^2,\"\")","v":""},{"$f":"IF(DataEntry!E30>0,SQRT((J31-$J$1)^2+(K31-$K$1)^2),\"\")","v":""},{"$f":"IF(DataEntry!E30>0,DataEntry!J30,\"\")","v":""},{"$f":"IF(DataEntry!E30>0,IF(AND(ABS(N31)>S31,ABS(O31)>S31),$R$5,IF(ABS(N31)>S31,$R$6,IF(ABS(O31)>S31,$R$7,IF(ABS(N31)+ABS(O31)>S31,$R$8,$R$9)))),\"\")","v":""},null,null,null,null,null,null,null,2.6446231890888821,4.061731405987663]
[null,null,null,null,null,null,null,22,{"$f":"IF(DataEntry!E31>0,DataEntry!B31,\"\")","v":""},{"$f":"IF(DataEntry!E31>0,DataEntry!D31,\"\")","v":""},{"$f":"IF(DataEntry!E31>0,DataEntry!G31,\"\")","v":""},{"$f":"IF(DataEntry!E31>0,((K32-$K$1)+(J32-$J$1))/SQRT(2),\"\")","v":""},{"$f":"IF(DataEntry!E31>0,SQRT((J32-(L32/SQRT(2)+$J$1))^2+(K32-(L32/SQRT(2)+$K$1))^2),\"\")","v":""},{"$f":"IF(DataEntry!E31>0,IF(L32=0,0,(L32/(ABS(L32)+M32))*R32),\"\")","v":""},{"$f":"IF(DataEntry!E31>0,IF(M32=0,0,(M32/(ABS(L32)+M32))*R32),\"\")","v":""},null,{"$f":"IF(DataEntry!E31>0,O32^2,\"\")","v":""},{"$f":"IF(DataEntry!E31>0,SQRT((J32-$J$1)^2+(K32-$K$1)^2),\"\")","v":""},{"$f":"IF(DataEntry!E31>0,DataEntry!J31,\"\")","v":""},{"$f":"IF(DataEntry!E31>0,IF(AND(ABS(N32)>S32,ABS(O32)>S32),$R$5,IF(ABS(N32)>S32,$R$6,IF(ABS(O32)>S32,$R$7,IF(ABS(N32)+ABS(O32)>S32,$R$8,$R$9)))),\"\")","v":""},null,null,null,null,null,null,null,2.9307789863611022,4.0093569025624598]
[null,null,null,null,null,null,null,23,{"$f":"IF(DataEntry!E32>0,DataEntry!B32,\"\")","v":""},{"$f":"IF(DataEntry!E32>0,DataEntry!D32,\"\")","v":""},{"$f":"IF(DataEntry!E32>0,DataEntry!G32,\"\")","v":""},{"$f":"IF(DataEntry!E32>0,((K33-$K$1)+(J33-$J$1))/SQRT(2),\"\")","v":""},{"$f":"IF(DataEntry!E32>0,SQRT((J33-(L33/SQRT(2)+$J$1))^2+(K33-(L33/SQRT(2)+$K$1))^2),\"\")","v":""},{"$f":"IF(DataEntry!E32>0,IF(L33=0,0,(L33/(ABS(L33)+M33))*R33),\"\")","v":""},{"$f":"IF(DataEntry!E32>0,IF(M33=0,0,(M33/(ABS(L33)+M33))*R33),\"\")","v":""},null,{"$f":"IF(DataEntry!E32>0,O33^2,\"\")","v":""},{"$f":"IF(DataEntry!E32>0,SQRT((J33-$J$1)^2+(K33-$K$1)^2),\"\")","v":""},{"$f":"IF(DataEntry!E32>0,DataEntry!J32,\"\")","v":""},{"$f":"IF(DataEntry!E32>0,IF(AND(ABS(N33)>S33,ABS(O33)>S33),$R$5,IF(ABS(N33)>S33,$R$6,IF(ABS(O33)>S33,$R$7,IF(ABS(N33)+ABS(O33)>S33,$R$8,$R$9)))),\"\")","v":""},null,null,null,null,null,null,null,3.2169347836333224,3.9448072431178751]
[null,null,null,null,null,null,null,24,{"$f":"IF(DataEntry!E33>0,DataEntry!B33,\"\")","v":""},{"$f":"IF(DataEntry!E33>0,DataEntry!D33,\"\")","v":""},{"$f":"IF(DataEntry!E33>0,DataEntry!G33,\"\")","v":""},{"$f":"IF(DataEntry!E33>0,((K34-$K$1)+(J34-$J$1))/SQRT(2),\"\")","v":""},{"$f":"IF(DataEntry!E33>0,SQRT((J34-(L34/SQRT(2)+$J$1))^2+(K34-(L34/SQRT(2)+$K$1))^2),\"\")","v":""},{"$f":"IF(DataEntry!E33>0,IF(L34=0,0,(L34/(ABS(L34)+M34))*R34),\"\")","v":""},{"$f":"IF(DataEntry!E33>0,IF(M34=0,0,(M34/(ABS(L34)+M34))*R34),\"\")","v":""},null,{"$f":"IF(DataEntry!E33>0,O34^2,\"\")","v":""},{"$f":"IF(DataEntry!E33>0,SQRT((J34-$J$1)^2+(K34-$K$1)^2),\"\")","v":""},{"$f":"IF(DataEntry!E33>0,DataEntry!J33,\"\")","v":""},{"$f":"IF(DataEntry!E33>0,IF(AND(ABS(N34)>S34,ABS(O34)>S34),$R$5,IF(ABS(N34)>S34,$R$6,IF(ABS(O34)>S34,$R$7,IF(ABS(N34)+ABS(O34)>S34,$R$8,$R$9)))),\"\")","v":""},null,null,null,null,null,null,null,3.5030905809055426,3.8677391345332852]
[null,null,null,null,null,null,null,25,{"$f":"IF(DataEntry!E34>0,DataEntry!B34,\"\")","v":""},{"$f":"IF(DataEntry!E34>0,DataEntry!D34,\"\")","v":""},{"$f":"IF(DataEntry!E34>0,DataEntry!G34,\"\")","v":""},{"$f":"IF(DataEntry!E34>0,((K35-$K$1)+(J35-$J$1))/SQRT(2),\"\")","v":""},{"$f":"IF(DataEntry!E34>0,SQRT((J35-(L35/SQRT(2)+$J$1))^2+(K35-(L35/SQRT(2)+$K$1))^2),\"\")","v":""},{"$f":"IF(DataEntry!E34>0,IF(L35=0,0,(L35/(ABS(L35)+M35))*R35),\"\")","v":""},{"$f":"IF(DataEntry!E34>0,IF(M35=0,0,(M35/(ABS(L35)+M35))*R35),\"\")","v":""},null,{"$f":"IF(DataEntry!E34>0,O35^2,\"\")","v":""},{"$f":"IF(DataEntry!E34>0,SQRT((J35-$J$1)^2+(K35-$K$1)^2),\"\")","v":""},{"$f":"IF(DataEntry!E34>0,DataEntry!J34,\"\")","v":""},{"$f":"IF(DataEntry!E34>0,IF(AND(ABS(N35)>S35,ABS(O35)>S35),$R$5,IF(ABS(N35)>S35,$R$6,IF(ABS(O35)>S35,$R$7,IF(ABS(N35)+ABS(O35)>S35,$R$8,$R$9)))),\"\")","v":""},null,null,null,null,null,null,null,3.7892463781777628,3.777725556210763]
[null,null,null,null,null,null,null,26,{"$f":"IF(DataEntry!E35>0,DataEntry!B35,\"\")","v":""},{"$f":"IF(DataEntry!E35>0,DataEntry!D35,\"\")","v":""},{"$f":"IF(DataEntry!E35>0,DataEntry!G35,\"\")","v":""},{"$f":"IF(DataEntry!E35>0,((K36-$K$1)+(J36-$J$1))/SQRT(2),\"\")","v":""},{"$f":"IF(DataEntry!E35>0,SQRT((J36-(L36/SQRT(2)+$J$1))^2+(K36-(L36/SQRT(2)+$K$1))^2),\"\")","v":""},{"$f":"IF(DataEntry!E35>0,IF(L36=0,0,(L36/(ABS(L36)+M36))*R36),\"\")","v":""},{"$f":"IF(DataEntry!E35>0,IF(M36=0,0,(M36/(ABS(L36)+M36))*R36),\"\")","v":""},null,{"$f":"IF(DataEntry!E35>0,O36^2,\"\")","v":""},{"$f":"IF(DataEntry!E35>0,SQRT((J36-$J$1)^2+(K36-$K$1)^2),\"\")","v":""},{"$f":"IF(DataEntry!E35>0,DataEntry!J35,\"\")","v":""},{"$f":"IF(DataEntry!E35>0,IF(AND(ABS(N36)>S36,ABS(O36)>S36),$R$5,IF(ABS(N36)>S36,$R$6,IF(ABS(O36)>S36,$R$7,IF(ABS(N36)+ABS(O36)>S36,$R$8,$R$9)))),\"\")","v":""},null,null,null,null,null,null,null,4.075402175449983,3.674242753301681]
[null,null,null,null,null,null,null,27,{"$f":"IF(DataEntry!E36>0,DataEntry!B36,\"\")","v":""},{"$f":"IF(DataEntry!E36>0,DataEntry!D36,\"\")","v":""},{"$f":"IF(DataEntry!E36>0,DataEntry!G36,\"\")","v":""},{"$f":"IF(DataEntry!E36>0,((K37-$K$1)+(J37-$J$1))/SQRT(2),\"\")","v":""},{"$f":"IF(DataEntry!E36>0,SQRT((J37-(L37/SQRT(2)+$J$1))^2+(K37-(L37/SQRT(2)+$K$1))^2),\"\")","v":""},{"$f":"IF(DataEntry!E36>0,IF(L37=0,0,(L37/(ABS(L37)+M37))*R37),\"\")","v":""},{"$f":"IF(DataEntry!E36>0,IF(M37=0,0,(M37/(ABS(L37)+M37))*R37),\"\")","v":""},null,{"$f":"IF(DataEntry!E36>0,O37^2,\"\")","v":""},{"$f":"IF(DataEntry!E36>0,SQRT((J37-$J$1)^2+(K37-$K$1)^2),\"\")","v":""},{"$f":"IF(DataEntry!E36>0,DataEntry!J36,\"\")","v":""},{"$f":"IF(DataEntry!E36>0,IF(AND(ABS(N37)>S37,ABS(O37)>S37),$R$5,IF(ABS(N37)>S37,$R$6,IF(ABS(O37)>S37,$R$7,IF(ABS(N37)+ABS(O37)>S37,$R$8,$R$9)))),\"\")","v":""},null,null,null,null,null,null,null,4.3615579727222036,3.5566530077519349]
[null,null,null,null,null,null,null,28,{"$f":"IF(DataEntry!E37>0,DataEntry!B37,\"\")","v":""},{"$f":"IF(DataEntry!E37>0,DataEntry!D37,\"\")","v":""},{"$f":"IF(DataEntry!E37>0,DataEntry!G37,\"\")","v":""},{"$f":"IF(DataEntry!E37>0,((K38-$K$1)+(J38-$J$1))/SQRT(2),\"\")","v":""},{"$f":"IF(DataEntry!E37>0,SQRT((J38-(L38/SQRT(2)+$J$1))^2+(K38-(L38/SQRT(2)+$K$1))^2),\"\")","v":""},{"$f":"IF(DataEntry!E37>0,IF(L38=0,0,(L38/(ABS(L38)+M38))*R38),\"\")","v":""},{"$f":"IF(DataEntry!E37>0,IF(M38=0,0,(M38/(ABS(L38)+M38))*R38),\"\")","v":""},null,{"$f":"IF(DataEntry!E37>0,O38^2,\"\")","v":""},{"$f":"IF(DataEntry!E37>0,SQRT((J38-$J$1)^2+(K38-$K$1)^2),\"\")","v":""},{"$f":"IF(DataEntry!E37>0,DataEntry!J37,\"\")","v":""},{"$f":"IF(DataEntry!E37>0,IF(AND(ABS(N38)>S38,ABS(O38)>S38),$R$5,IF(ABS(N38)>S38,$R$6,IF(ABS(O38)>S38,$R$7,IF(ABS(N38)+ABS(O38)>S38,$R$8,$R$9)))),\"\")","v":""},null,null,null,null,null,null,null,4.6477137699944242,3.424181715790735]
[null,null,null,null,null,null,null,29,{"$f":"IF(DataEntry!E38>0,DataEntry!B38,\"\")","v":""},{"$f":"IF(DataEntry!E38>0,DataEntry!D38,\"\")","v":""},{"$f":"IF(DataEntry!E38>0,DataEntry!G38,\"\")","v":""},{"$f":"IF(DataEntry!E38>0,((K39-$K$1)+(J39-$J$1))/SQRT(2),\"\")","v":""},{"$f":"IF(DataEntry!E38>0,SQRT((J39-(L39/SQRT(2)+$J$1))^2+(K39-(L39/SQRT(2)+$K$1))^2),\"\")","v":""},{"$f":"IF(DataEntry!E38>0,IF(L39=0,0,(L39/(ABS(L39)+M39))*R39),\"\")","v":""},{"$f":"IF(DataEntry!E38>0,IF(M39=0,0,(M39/(ABS(L39)+M39))*R39),\"\")","v":""},null,{"$f":"IF(DataEntry!E38>0,O39^2,\"\")","v":""},{"$f":"IF(DataEntry!E38>0,SQRT((J39-$J$1)^2+(K39-$K$1)^2),\"\")","v":""},{"$f":"IF(DataEntry!E38>0,DataEntry!J38,\"\")","v":""},{"$f":"IF(DataEntry!E38>0,IF(AND(ABS(N39)>S39,ABS(O39)>S39),$R$5,IF(ABS(N39)>S39,$R$6,IF(ABS(O39)>S39,$R$7,IF(ABS(N39)+ABS(O39)>S39,$R$8,$R$9)))),\"\")","v":""},null,null,null,null,null,null,null,4.9338695672666448,3.2758865899817282]
[null,null,null,null,null,null,null,30,{"$f":"IF(DataEntry!E39>0,DataEntry!B39,\"\")","v":""},{"$f":"IF(DataEntry!E39>0,DataEntry!D39,\"\")","v":""},{"$f":"IF(DataEntry!E39>0,DataEntry!G39,\"\")","v":""},{"$f":"IF(DataEntry!E39>0,((K40-$K$1)+(J40-$J$1))/SQRT(2),\"\")","v":""},{"$f":"IF(DataEntry!E39>0,SQRT((J40-(L40/SQRT(2)+$J$1))^2+(K40-(L40/SQRT(2)+$K$1))^2),\"\")","v":""},{"$f":"IF(DataEntry!E39>0,IF(L40=0,0,(L40/(ABS(L40)+M40))*R40),\"\")","v":""},{"$f":"IF(DataEntry!E39>0,IF(M40=0,0,(M40/(ABS(L40)+M40))*R40),\"\")","v":""},null,{"$f":"IF(DataEntry!E39>0,O40^2,\"\")","v":""},{"$f":"IF(DataEntry!E39>0,SQRT((J40-$J$1)^2+(K40-$K$1)^2),\"\")","v":""},{"$f":"IF(DataEntry!E39>0,DataEntry!J39,\"\")","v":""},{"$f":"IF(DataEntry!E39>0,IF(AND(ABS(N40)>S40,ABS(O40)>S40),$R$5,IF(ABS(N40)>S40,$R$6,IF(ABS(O40)>S40,$R$7,IF(ABS(N40)+ABS(O40)>S40,$R$8,$R$9)))),\"\")","v":""},null,null,null,null,null,null,null,5.2200253645388655,3.1106156794958055]
[null,null,null,null,null,null,null,null,null,null,null,null,null,null,null,null,null,null,null,null,null,null,null,null,null,null,null,5.5061811618110861,2.9269490628874548]
[null,null,null,null,null,null,null,null,null,null,null,null,null,null,null,null,null,null,null,null,null,null,null,null,null,null,null,5.7923369590833067,2.7231159454444027]
[null,null,null,null,null,null,null,null,null,null,null,null,null,null,null,null,null,null,null,null,null,null,null,null,null,null,null,6.0784927563555273,2.4968733635870191]
[null,null,null,null,null,null,null,null,null,null,null,null,null,null,null,null,null,null,null,null,null,null,null,null,null,null,null,6.364648553627748,2.2453224062015451]
[null,null,null,null,null,null,null,null,null,null,null,null,null,null,null,null,null,null,null,null,null,null,null,null,null,null,null,6.6508043508999686,1.9646175314985195]
[null,null,null,null,null,null,null,null,null,null,null,null,null,null,null,null,null,null,null,null,null,null,null,null,null,null,null,6.9369601481721892,1.6494813734974727]
[null,null,null,null,null,null,null,null,null,null,null,null,null,null,null,null,null,null,null,null,null,null,null,null,null,null,null,7.2231159454444098,1.292336959083296]
[null,null,null,null,null,null,null,null,null,null,null,null,null,null,null,null,null,null,null,null,null,null,null,null,null,null,null,7.5092717427166304,0.88160608736898105]
[null,null,null,null,null,null,null,null,null,null,null,null,null,null,null,null,null,null,null,null,null,null,null,null,null,null,null,7.7954275399888511,0.39791182699940375]
[null,null,null,null,null,null,null,null,null,null,null,null,null,null,null,null,null,null,null,null,null,null,null,null,null,null,null,8.0815833372610708,-0.19625723897502922]
[null,null,null,null,null,null,null,null,null,null,null,null,null,null,null,null,null,null,null,null,null,null,null,null,null,null,null,8.3677391345332914,-0.99690941909447872]
[null,null,null,null,null,null,null,null,null,null,null,null,null,null,null,null,null,null,null,null,null,null,null,null,null,null,null,8.6538949318055121,-2.9999996960747533]
[null,null,null,null,null,null,null,null,null,null,null,null,null,null,null,null,null,null,null,null,null,null,null,null,null,null,null,{"$f":"AB52-$Z$3","v":8.3677391345332914},{"$f":"-SQRT(ABS(($Y$3^2)-((AB53-$Y$1)^2)))+$Y$2","v":-5.0030905809055213}]
[null,null,null,null,null,null,null,null,null,null,null,null,null,null,null,null,null,null,null,null,null,null,null,null,null,null,null,{"$f":"AB53-$Z$3","v":8.0815833372610708},{"$f":"-SQRT(ABS(($Y$3^2)-((AB54-$Y$1)^2)))+$Y$2","v":-5.8037427610249708}]
[null,null,null,null,null,null,null,null,null,null,null,null,null,null,null,null,null,null,null,null,null,null,null,null,null,null,null,7.7954275399888502,-6.3979118269994064]
[null,null,null,null,null,null,null,null,null,null,null,null,null,null,null,null,null,null,null,null,null,null,null,null,null,null,null,7.5092717427166296,-6.8816060873689828]
[null,null,null,null,null,null,null,null,null,null,null,null,null,null,null,null,null,null,null,null,null,null,null,null,null,null,null,7.2231159454444089,-7.2923369590832978]
[null,null,null,null,null,null,null,null,null,null,null,null,null,null,null,null,null,null,null,null,null,null,null,null,null,null,null,6.9369601481721883,-7.6494813734974745]
[null,null,null,null,null,null,null,null,null,null,null,null,null,null,null,null,null,null,null,null,null,null,null,null,null,null,null,6.6508043508999677,-7.9646175314985204]
[null,null,null,null,null,null,null,null,null,null,null,null,null,null,null,null,null,null,null,null,null,null,null,null,null,null,null,6.3646485536277471,-8.2453224062015451]
[null,null,null,null,null,null,null,null,null,null,null,null,null,null,null,null,null,null,null,null,null,null,null,null,null,null,null,6.0784927563555264,-8.4968733635870208]
[null,null,null,null,null,null,null,null,null,null,null,null,null,null,null,null,null,null,null,null,null,null,null,null,null,null,null,5.7923369590833058,-8.7231159454444018]
[null,null,null,null,null,null,null,null,null,null,null,null,null,null,null,null,null,null,null,null,null,null,null,null,null,null,null,5.5061811618110852,-8.9269490628874557]
[null,null,null,null,null,null,null,null,null,null,null,null,null,null,null,null,null,null,null,null,null,null,null,null,null,null,null,5.2200253645388646,-9.1106156794958046]
[null,null,null,null,null,null,null,null,null,null,null,null,null,null,null,null,null,null,null,null,null,null,null,null,null,null,null,4.9338695672666439,-9.2758865899817291]
[null,null,null,null,null,null,null,null,null,null,null,null,null,null,null,null,null,null,null,null,null,null,null,null,null,null,null,4.6477137699944233,-9.4241817157907342]
[null,null,null,null,null,null,null,null,null,null,null,null,null,null,null,null,null,null,null,null,null,null,null,null,null,null,null,4.3615579727222027,-9.5566530077519367]
[null,null,null,null,null,null,null,null,null,null,null,null,null,null,null,null,null,null,null,null,null,null,null,null,null,null,null,4.0754021754499821,-9.6742427533016802]
[null,null,null,null,null,null,null,null,null,null,null,null,null,null,null,null,null,null,null,null,null,null,null,null,null,null,null,3.7892463781777619,-9.777725556210763]
[null,null,null,null,null,null,null,null,null,null,null,null,null,null,null,null,null,null,null,null,null,null,null,null,null,null,null,3.5030905809055417,-9.8677391345332843]
[null,null,null,null,null,null,null,null,null,null,null,null,null,null,null,null,null,null,null,null,null,null,null,null,null,null,null,3.2169347836333215,-9.9448072431178751]
[null,null,null,null,null,null,null,null,null,null,null,null,null,null,null,null,null,null,null,null,null,null,null,null,null,null,null,2.9307789863611013,-10.009356902562459]
[null,null,null,null,null,null,null,null,null,null,null,null,null,null,null,null,null,null,null,null,null,null,null,null,null,null,null,2.6446231890888812,-10.061731405987663]
[null,null,null,null,null,null,null,null,null,null,null,null,null,null,null,null,null,null,null,null,null,null,null,null,null,null,null,2.358467391816661,-10.102200112113147]
[null,null,null,null,null,null,null,null,null,null,null,null,null,null,null,null,null,null,null,null,null,null,null,null,null,null,null,2.0723115945444408,-10.130965722401314]
[null,null,null,null,null,null,null,null,null,null,null,null,null,null,null,null,null,null,null,null,null,null,null,null,null,null,null,1.7861557972722206,-10.148169524780453]
[null,null,null,null,null,null,null,null,null,null,null,null,null,null,null,null,null,null,null,null,null,null,null,null,null,null,null,1.5000000000000004,-10.153894931805507]
[null,null,null,null,null,null,null,null,null,null,null,null,null,null,null,null,null,null,null,null,null,null,null,null,null,null,null,1.2138442027277803,-10.148169524780453]
[null,null,null,null,null,null,null,null,null,null,null,null,null,null,null,null,null,null,null,null,null,null,null,null,null,null,null,0.92768840545556008,-10.130965722401314]
[null,null,null,null,null,null,null,null,null,null,null,null,null,null,null,null,null,null,null,null,null,null,null,null,null,null,null,0.6415326081833399,-10.102200112113147]
[null,null,null,null,null,null,null,null,null,null,null,null,null,null,null,null,null,null,null,null,null,null,null,null,null,null,null,0.35537681091111967,-10.061731405987663]
[null,null,null,null,null,null,null,null,null,null,null,null,null,null,null,null,null,null,null,null,null,null,null,null,null,null,null,6.9221013638899431E-2,-10.009356902562461]
[null,null,null,null,null,null,null,null,null,null,null,null,null,null,null,null,null,null,null,null,null,null,null,null,null,null,null,-0.2169347836333208,-9.9448072431178751]
[null,null,null,null,null,null,null,null,null,null,null,null,null,null,null,null,null,null,null,null,null,null,null,null,null,null,null,-0.50309058090554104,-9.8677391345332861]
[null,null,null,null,null,null,null,null,null,null,null,null,null,null,null,null,null,null,null,null,null,null,null,null,null,null,null,-0.78924637817776122,-9.7777255562107648]
[null,null,null,null,null,null,null,null,null,null,null,null,null,null,null,null,null,null,null,null,null,null,null,null,null,null,null,-1.0754021754499814,-9.6742427533016802]
[null,null,null,null,null,null,null,null,null,null,null,null,null,null,null,null,null,null,null,null,null,null,null,null,null,null,null,-1.3615579727222016,-9.5566530077519367]
[null,null,null,null,null,null,null,null,null,null,null,null,null,null,null,null,null,null,null,null,null,null,null,null,null,null,null,-1.6477137699944218,-9.4241817157907377]
[null,null,null,null,null,null,null,null,null,null,null,null,null,null,null,null,null,null,null,null,null,null,null,null,null,null,null,-1.9338695672666419,-9.2758865899817309]
[null,null,null,null,null,null,null,null,null,null,null,null,null,null,null,null,null,null,null,null,null,null,null,null,null,null,null,-2.2200253645388623,-9.1106156794958082]
[null,null,null,null,null,null,null,null,null,null,null,null,null,null,null,null,null,null,null,null,null,null,null,null,null,null,null,-2.5061811618110825,-8.9269490628874575]
[null,null,null,null,null,null,null,null,null,null,null,null,null,null,null,null,null,null,null,null,null,null,null,null,null,null,null,-2.7923369590833027,-8.7231159454444054]
[null,null,null,null,null,null,null,null,null,null,null,null,null,null,null,null,null,null,null,null,null,null,null,null,null,null,null,-3.0784927563555229,-8.4968733635870226]
[null,null,null,null,null,null,null,null,null,null,null,null,null,null,null,null,null,null,null,null,null,null,null,null,null,null,null,-3.3646485536277431,-8.2453224062015487]
[null,null,null,null,null,null,null,null,null,null,null,null,null,null,null,null,null,null,null,null,null,null,null,null,null,null,null,-3.6508043508999632,-7.9646175314985257]
[null,null,null,null,null,null,null,null,null,null,null,null,null,null,null,null,null,null,null,null,null,null,null,null,null,null,null,-3.9369601481721834,-7.6494813734974807]
[null,null,null,null,null,null,null,null,null,null,null,null,null,null,null,null,null,null,null,null,null,null,null,null,null,null,null,-4.2231159454444036,-7.2923369590833049]
[null,null,null,null,null,null,null,null,null,null,null,null,null,null,null,null,null,null,null,null,null,null,null,null,null,null,null,-4.5092717427166242,-6.8816060873689917]
[null,null,null,null,null,null,null,null,null,null,null,null,null,null,null,null,null,null,null,null,null,null,null,null,null,null,null,-4.7954275399888449,-6.3979118269994153]
[null,null,null,null,null,null,null,null,null,null,null,null,null,null,null,null,null,null,null,null,null,null,null,null,null,null,null,-5.0815833372610655,-5.8037427610249832]
[null,null,null,null,null,null,null,null,null,null,null,null,null,null,null,null,null,null,null,null,null,null,null,null,null,null,null,-5.3677391345332861,-5.0030905809055408]
[null,null,null,null,null,null,null,null,null,null,null,null,null,null,null,null,null,null,null,null,null,null,null,null,null,null,null,-5.6538949318055067,-3.0000001192092896]
[null,null,null,null,null,null,null,null,null,null,null,null,null,null,null,null,null,null,null,null,null,null,null,null,"X1",null,null,{"$f":"AB109-Q2","v":-5.6538949318055058},{"$f":"AE109","v":-3}]
[null,null,null,null,null,null,null,null,null,null,null,null,null,null,null,null,null,null,null,null,null,null,null,null,"X2",null,null,{"$f":"AB109+Q2","v":8.6538949318055067},{"$f":"AE109","v":-3}]
[]
[null,null,null,null,null,null,null,null,null,null,null,null,null,null,null,null,null,null,null,null,null,null,null,null,"Y1",null,null,{"$f":"AB109","v":1.5},{"$f":"AE109+(Q2)","v":4.1538949318055058}]
[null,null,null,null,null,null,null,null,null,null,null,null,null,null,null,null,null,null,null,null,null,null,null,null,"Y2",null,null,{"$f":"AB109","v":1.5},{"$f":"AE109-(Q2)","v":-10.153894931805507}]
[null,null,null,null,null,null,null,null,null,null,null,null,null,null,null,null,null,null,null,null,null,null,null,null,{"$f":"AB108-AE108","v":4.5},null,null,{"$f":"AB109-Y110","v":-15.5},null,null,{"$f":"AE109-Y110","v":-20}]
[null,null,null,null,null,null,null,null,null,null,null,null,null,null,null,null,null,null,null,null,null,null,null,null,{"$f":"AB109-AE109","v":4.5},null,null,{"$f":"Y1","v":1.5},null,null,{"$f":"Y2","v":-3}]
[null,null,null,null,null,null,null,null,null,null,null,null,null,null,null,null,null,null,null,null,null,null,null,null,{"$f":"MAX(X112:X113)","v":17},null,null,{"$f":"Y110+AB109","v":18.5},null,null,{"$f":"Y110+AE109","v":14}]
[null,null,null,null,null,null,null,null,null,null,null,null,null,null,null,null,null,null,null,null,null,null,null,null,null,null,{"$f":"IF(DataEntry!E10>0,DataEntry!B10,#N/A)","v":"A"},{"$f":"IF(DataEntry!E10>0,DataEntry!D10,#N/A)","v":-2},null,{"$f":"IF(DataEntry!E10>0,DataEntry!G10,#N/A)","v":-7}]
[null,null,null,null,null,null,null,null,null,null,null,null,null,null,null,null,null,null,null,null,null,null,null,{"$f":"MAX(DataEntry!D10:D39)-MIN(DataEntry!D10:D39)","v":6},null,null,{"$f":"IF(DataEntry!E11>0,DataEntry!B11,#N/A)","v":"B"},{"$f":"IF(DataEntry!E11>0,DataEntry!D11,#N/A)","v":1},null,{"$f":"IF(DataEntry!E11>0,DataEntry!G11,#N/A)","v":-3}]
[null,null,null,null,null,null,null,null,null,null,null,null,null,null,null,null,null,null,null,null,null,null,null,{"$f":"MAX(DataEntry!G10:G39)-MIN(DataEntry!G10:G39)","v":17},null,null,{"$f":"IF(DataEntry!E12>0,DataEntry!B12,#N/A)","v":"C"},{"$f":"IF(DataEntry!E12>0,DataEntry!D12,#N/A)","v":4},null,{"$f":"IF(DataEntry!E12>0,DataEntry!G12,#N/A)","v":-8}]
[null,null,null,null,null,null,null,null,null,null,null,null,null,null,null,null,null,null,null,null,null,null,null,null,null,null,{"$f":"IF(DataEntry!E13>0,DataEntry!B13,#N/A)","v":"D"},{"$f":"IF(DataEntry!E13>0,DataEntry!D13,#N/A)","v":3},null,{"$f":"IF(DataEntry!E13>0,DataEntry!G13,#N/A)","v":9}]
[null,null,null,null,null,null,null,null,null,null,null,null,null,null,null,null,null,null,null,null,null,null,null,null,null,null,{"$f":"IF(DataEntry!E14>0,DataEntry!B14,#N/A)","v":"E"},{"$f":"IF(DataEntry!E14>0,DataEntry!D14,#N/A)","v":2},null,{"$f":"IF(DataEntry!E14>0,DataEntry!G14,#N/A)","v":-4}]
[null,null,null,null,null,null,null,null,null,null,null,null,null,null,null,null,null,null,null,null,null,null,null,null,null,null,{"$f":"IF(DataEntry!E15>0,DataEntry!B15,#N/A)","v":"F"},{"$f":"IF(DataEntry!E15>0,DataEntry!D15,#N/A)","v":0},null,{"$f":"IF(DataEntry!E15>0,DataEntry!G15,#N/A)","v":2}]
[null,null,null,null,null,null,null,null,null,null,null,null,null,null,null,null,null,null,null,null,null,null,null,null,null,null,{"$f":"IF(DataEntry!E16>0,DataEntry!B16,#N/A)","v":"G"},{"$f":"IF(DataEntry!E16>0,DataEntry!D16,#N/A)","v":1},null,{"$f":"IF(DataEntry!E16>0,DataEntry!G16,#N/A)","v":-1}]
[null,null,null,null,null,null,null,null,null,null,null,null,null,null,null,null,null,null,null,null,null,null,null,null,null,null,{"$f":"IF(DataEntry!E17>0,DataEntry!B17,#N/A)","v":"H"},{"$f":"IF(DataEntry!E17>0,DataEntry!D17,#N/A)","v":2},null,{"$f":"IF(DataEntry!E17>0,DataEntry!G17,#N/A)","v":-3}]
[null,null,null,null,null,null,null,null,null,null,null,null,null,null,null,null,null,null,null,null,null,null,null,null,null,null,{"$f":"IF(DataEntry!E18>0,DataEntry!B18,#N/A)","v":{"$error":"#N/A"}},{"$f":"IF(DataEntry!E18>0,DataEntry!D18,#N/A)","v":{"$error":"#N/A"}},null,{"$f":"IF(DataEntry!E18>0,DataEntry!G18,#N/A)","v":{"$error":"#N/A"}}]
[null,null,null,null,null,null,null,null,null,null,null,null,null,null,null,null,null,null,null,null,null,null,null,null,null,null,{"$f":"IF(DataEntry!E19>0,DataEntry!B19,#N/A)","v":{"$error":"#N/A"}},{"$f":"IF(DataEntry!E19>0,DataEntry!D19,#N/A)","v":{"$error":"#N/A"}},null,{"$f":"IF(DataEntry!E19>0,DataEntry!G19,#N/A)","v":{"$error":"#N/A"}}]
[null,null,null,null,null,null,null,null,null,null,null,null,null,null,null,null,null,null,null,null,null,null,null,null,null,null,{"$f":"IF(DataEntry!E20>0,DataEntry!B20,#N/A)","v":{"$error":"#N/A"}},{"$f":"IF(DataEntry!E20>0,DataEntry!D20,#N/A)","v":{"$error":"#N/A"}},null,{"$f":"IF(DataEntry!E20>0,DataEntry!G20,#N/A)","v":{"$error":"#N/A"}}]
[null,null,null,null,null,null,null,null,null,null,null,null,null,null,null,null,null,null,null,null,null,null,null,null,null,null,{"$f":"IF(DataEntry!E21>0,DataEntry!B21,#N/A)","v":{"$error":"#N/A"}},{"$f":"IF(DataEntry!E21>0,DataEntry!D21,#N/A)","v":{"$error":"#N/A"}},null,{"$f":"IF(DataEntry!E21>0,DataEntry!G21,#N/A)","v":{"$error":"#N/A"}}]
[null,null,null,null,null,null,null,null,null,null,null,null,null,null,null,null,null,null,null,null,null,null,null,null,null,null,{"$f":"IF(DataEntry!E22>0,DataEntry!B22,#N/A)","v":{"$error":"#N/A"}},{"$f":"IF(DataEntry!E22>0,DataEntry!D22,#N/A)","v":{"$error":"#N/A"}},null,{"$f":"IF(DataEntry!E22>0,DataEntry!G22,#N/A)","v":{"$error":"#N/A"}}]
[null,null,null,null,null,null,null,null,null,null,null,null,null,null,null,null,null,null,null,null,null,null,null,null,null,null,{"$f":"IF(DataEntry!E23>0,DataEntry!B23,#N/A)","v":{"$error":"#N/A"}},{"$f":"IF(DataEntry!E23>0,DataEntry!D23,#N/A)","v":{"$error":"#N/A"}},null,{"$f":"IF(DataEntry!E23>0,DataEntry!G23,#N/A)","v":{"$error":"#N/A"}}]
[null,null,null,null,null,null,null,null,null,null,null,null,null,null,null,null,null,null,null,null,null,null,null,null,null,null,{"$f":"IF(DataEntry!E24>0,DataEntry!B24,#N/A)","v":{"$error":"#N/A"}},{"$f":"IF(DataEntry!E24>0,DataEntry!D24,#N/A)","v":{"$error":"#N/A"}},null,{"$f":"IF(DataEntry!E24>0,DataEntry!G24,#N/A)","v":{"$error":"#N/A"}}]
[null,null,null,null,null,null,null,null,null,null,null,null,null,null,null,null,null,null,null,null,null,null,null,null,null,null,{"$f":"IF(DataEntry!E25>0,DataEntry!B25,#N/A)","v":{"$error":"#N/A"}},{"$f":"IF(DataEntry!E25>0,DataEntry!D25,#N/A)","v":{"$error":"#N/A"}},null,{"$f":"IF(DataEntry!E25>0,DataEntry!G25,#N/A)","v":{"$error":"#N/A"}}]
[null,null,null,null,null,null,null,null,null,null,null,null,null,null,null,null,null,null,null,null,null,null,null,null,null,null,{"$f":"IF(DataEntry!E26>0,DataEntry!B26,#N/A)","v":{"$error":"#N/A"}},{"$f":"IF(DataEntry!E26>0,DataEntry!D26,#N/A)","v":{"$error":"#N/A"}},null,{"$f":"IF(DataEntry!E26>0,DataEntry!G26,#N/A)","v":{"$error":"#N/A"}}]
[null,null,null,null,null,null,null,null,null,null,null,null,null,null,null,null,null,null,null,null,null,null,null,null,null,null,{"$f":"IF(DataEntry!E27>0,DataEntry!B27,#N/A)","v":{"$error":"#N/A"}},{"$f":"IF(DataEntry!E27>0,DataEntry!D27,#N/A)","v":{"$error":"#N/A"}},null,{"$f":"IF(DataEntry!E27>0,DataEntry!G27,#N/A)","v":{"$error":"#N/A"}}]
[null,null,null,null,null,null,null,null,null,null,null,null,null,null,null,null,null,null,null,null,null,null,null,null,null,null,{"$f":"IF(DataEntry!E28>0,DataEntry!B28,#N/A)","v":{"$error":"#N/A"}},{"$f":"IF(DataEntry!E28>0,DataEntry!D28,#N/A)","v":{"$error":"#N/A"}},null,{"$f":"IF(DataEntry!E28>0,DataEntry!G28,#N/A)","v":{"$error":"#N/A"}}]
[null,null,null,null,null,null,null,null,null,null,null,null,null,null,null,null,null,null,null,null,null,null,null,null,null,null,{"$f":"IF(DataEntry!E29>0,DataEntry!B29,#N/A)","v":{"$error":"#N/A"}},{"$f":"IF(DataEntry!E29>0,DataEntry!D29,#N/A)","v":{"$error":"#N/A"}},null,{"$f":"IF(DataEntry!E29>0,DataEntry!G29,#N/A)","v":{"$error":"#N/A"}}]
[null,null,null,null,null,null,null,null,null,null,null,null,null,null,null,null,null,null,null,null,null,null,null,null,null,null,{"$f":"IF(DataEntry!E30>0,DataEntry!B30,#N/A)","v":{"$error":"#N/A"}},{"$f":"IF(DataEntry!E30>0,DataEntry!D30,#N/A)","v":{"$error":"#N/A"}},null,{"$f":"IF(DataEntry!E30>0,DataEntry!G30,#N/A)","v":{"$error":"#N/A"}}]
[null,null,null,null,null,null,null,null,null,null,null,null,null,null,null,null,null,null,null,null,null,null,null,null,null,null,{"$f":"IF(DataEntry!E31>0,DataEntry!B31,#N/A)","v":{"$error":"#N/A"}},{"$f":"IF(DataEntry!E31>0,DataEntry!D31,#N/A)","v":{"$error":"#N/A"}},null,{"$f":"IF(DataEntry!E31>0,DataEntry!G31,#N/A)","v":{"$error":"#N/A"}}]
[null,null,null,null,null,null,null,null,null,null,null,null,null,null,null,null,null,null,null,null,null,null,null,null,null,null,{"$f":"IF(DataEntry!E32>0,DataEntry!B32,#N/A)","v":{"$error":"#N/A"}},{"$f":"IF(DataEntry!E32>0,DataEntry!D32,#N/A)","v":{"$error":"#N/A"}},null,{"$f":"IF(DataEntry!E32>0,DataEntry!G32,#N/A)","v":{"$error":"#N/A"}}]
[null,null,null,null,null,null,null,null,null,null,null,null,null,null,null,null,null,null,null,null,null,null,null,null,null,null,{"$f":"IF(DataEntry!E33>0,DataEntry!B33,#N/A)","v":{"$error":"#N/A"}},{"$f":"IF(DataEntry!E33>0,DataEntry!D33,#N/A)","v":{"$error":"#N/A"}},null,{"$f":"IF(DataEntry!E33>0,DataEntry!G33,#N/A)","v":{"$error":"#N/A"}}]
[null,null,null,null,null,null,null,null,null,null,null,null,null,null,null,null,null,null,null,null,null,null,null,null,null,null,{"$f":"IF(DataEntry!E34>0,DataEntry!B34,#N/A)","v":{"$error":"#N/A"}},{"$f":"IF(DataEntry!E34>0,DataEntry!D34,#N/A)","v":{"$error":"#N/A"}},null,{"$f":"IF(DataEntry!E34>0,DataEntry!G34,#N/A)","v":{"$error":"#N/A"}}]
[null,null,null,null,null,null,null,null,null,null,null,null,null,null,null,null,null,null,null,null,null,null,null,null,null,null,{"$f":"IF(DataEntry!E35>0,DataEntry!B35,#N/A)","v":{"$error":"#N/A"}},{"$f":"IF(DataEntry!E35>0,DataEntry!D35,#N/A)","v":{"$error":"#N/A"}},null,{"$f":"IF(DataEntry!E35>0,DataEntry!G35,#N/A)","v":{"$error":"#N/A"}}]
[null,null,null,null,null,null,null,null,null,null,null,null,null,null,null,null,null,null,null,null,null,null,null,null,null,null,{"$f":"IF(DataEntry!E36>0,DataEntry!B36,#N/A)","v":{"$error":"#N/A"}},{"$f":"IF(DataEntry!E36>0,DataEntry!D36,#N/A)","v":{"$error":"#N/A"}},null,{"$f":"IF(DataEntry!E36>0,DataEntry!G36,#N/A)","v":{"$error":"#N/A"}}]
[null,null,null,null,null,null,null,null,null,null,null,null,null,null,null,null,null,null,null,null,null,null,null,null,null,null,{"$f":"IF(DataEntry!E37>0,DataEntry!B37,#N/A)","v":{"$error":"#N/A"}},{"$f":"IF(DataEntry!E37>0,DataEntry!D37,#N/A)","v":{"$error":"#N/A"}},null,{"$f":"IF(DataEntry!E37>0,DataEntry!G37,#N/A)","v":{"$error":"#N/A"}}]
[null,null,null,null,null,null,null,null,null,null,null,null,null,null,null,null,null,null,null,null,null,null,null,null,null,null,{"$f":"IF(DataEntry!E38>0,DataEntry!B38,#N/A)","v":{"$error":"#N/A"}},{"$f":"IF(DataEntry!E38>0,DataEntry!D38,#N/A)","v":{"$error":"#N/A"}},null,{"$f":"IF(DataEntry!E38>0,DataEntry!G38,#N/A)","v":{"$error":"#N/A"}}]
[null,null,null,null,null,null,null,null,null,null,null,null,null,null,null,null,null,null,null,null,null,null,null,null,null,null,{"$f":"IF(DataEntry!E39>0,DataEntry!B39,#N/A)","v":{"$error":"#N/A"}},{"$f":"IF(DataEntry!E39>0,DataEntry!D39,#N/A)","v":{"$error":"#N/A"}},null,{"$f":"IF(DataEntry!E39>0,DataEntry!G39,#N/A)","v":{"$error":"#N/A"}}]